Pyridine, 4-methoxy-, protonated

Reaction thermochemistry data

Data compiled by: Michael M. Meot-Ner (Mautner) and Sharon G. Lias

Individual Reactions

C6H8NO+ + Water = (C6H8NO+ • Water)

By formula: C6H8NO+ + H2O = (C6H8NO+ • H2O)

Bond type: Hydrogen bond (positive ion to hydride)

Free energy of reaction

ΔrG° (kcal/mol) T (K) Method Reference Comment
3.4400.PHPMSDavidson, Sunner J., et al., 1979gas phase

Ion clustering data

Data compiled by: Michael M. Meot-Ner (Mautner) and Sharon G. Lias

Clustering reactions

C6H8NO+ + Water = (C6H8NO+ • Water)

By formula: C6H8NO+ + H2O = (C6H8NO+ • H2O)

Bond type: Hydrogen bond (positive ion to hydride)

Free energy of reaction

ΔrG° (kcal/mol) T (K) Method Reference Comment
3.4400.PHPMSDavidson, Sunner J., et al., 1979gas phase

References

Davidson, Sunner J., et al., 1979
Davidson, W.R.; Sunner J.; Kebarle, P., Hydrogen Bonding of Water to Onium Ions. Hydration of Substituted Pyridinium Ions and Related Systems, J. Am. Chem. Soc., 1979, 101, 7, 1675, https://doi.org/10.1021/ja00501a005 . [all data]