1-Hexanamine, protonated
- Formula: C6H16N+
- Molecular weight: 102.1974

Ion clustering data

Data compiled by: Michael M. Meot-Ner (Mautner) and Sharon G. Lias
Clustering reactions
By formula: C6H16N+ + H2O = (C6H16N+ • H2O)
Bond type: Hydrogen bond (positive ion to hydride)
Quantity | Value | Units | Method | Reference | Comment |
---|---|---|---|---|---|
ΔrH° | 15.2 | kcal/mol | ES/HPMS | Blades, Klassen, et al., 1996 | gas phase |
Quantity | Value | Units | Method | Reference | Comment |
ΔrS° | 22.8 | cal/mol*K | ES/HPMS | Blades, Klassen, et al., 1996 | gas phase |
Quantity | Value | Units | Method | Reference | Comment |
ΔrG° | 8.4 | kcal/mol | ES/HPMS | Blades, Klassen, et al., 1996 | gas phase |

References

Blades, Klassen, et al., 1996
Blades, A.T.; Klassen, J.S.; Kebarle, P.,
Determination of Ion-Solvent Equilibria in the Gas Phase. Hydration of Diprotonated Diamines and Bis(trimethylammonium) Alkanes,
J. Am. Chem. Soc., 1996, 118, 49, 12437, https://doi.org/10.1021/ja962641t
. [all data]