Triethyl germyl, positive ion
- Formula: C6H15Ge+
- Molecular weight: 159.82

Ion clustering data

Data compiled by: Michael M. Meot-Ner (Mautner) and Sharon G. Lias
Clustering reactions
By formula: C6H15Ge+ + H2O = (C6H15Ge+ • H2O)
Quantity | Value | Units | Method | Reference | Comment |
---|---|---|---|---|---|
ΔrH° | 104. | kJ/mol | PHPMS | Stone and Wytenberg, 1987 | gas phase |
Quantity | Value | Units | Method | Reference | Comment |
ΔrS° | 132. | J/mol*K | PHPMS | Stone and Wytenberg, 1987 | gas phase |
(C6H15Ge+ • ) +
= (C6H15Ge+ • 2
)
By formula: (C6H15Ge+ • H2O) + H2O = (C6H15Ge+ • 2H2O)
Quantity | Value | Units | Method | Reference | Comment |
---|---|---|---|---|---|
ΔrH° | 77.0 | kJ/mol | PHPMS | Stone and Wytenberg, 1987 | gas phase |
Quantity | Value | Units | Method | Reference | Comment |
ΔrS° | 137. | J/mol*K | PHPMS | Stone and Wytenberg, 1987 | gas phase |

References

Stone and Wytenberg, 1987
Stone, J.A.; Wytenberg, W.J.,
The Binding Energies of Trialkylgermanium Cations to Water Molecules Studied by High Pressure Mass Spectrometry,
Can. J. Chem., 1987, 65, 9, 2146, https://doi.org/10.1139/v87-358
. [all data]