Cyclohexanamine, protonated
- Formula: C6H14N+
- Molecular weight: 100.1815

Ion clustering data

Data compiled by: Michael M. Meot-Ner (Mautner) and Sharon G. Lias
Clustering reactions
By formula: C6H14N+ + C4H10O = (C6H14N+ • C4H10O)
Bond type: Hydrogen bonds of the type NH+-O between organics
Quantity | Value | Units | Method | Reference | Comment |
---|---|---|---|---|---|
ΔrH° | 92.0 | kJ/mol | PHPMS | Meot-Ner, 1984 | gas phase |
ΔrH° | 91.6 | kJ/mol | PHPMS | Meot-Ner (Mautner), 1983 | gas phase |
Quantity | Value | Units | Method | Reference | Comment |
ΔrS° | 133. | J/mol*K | PHPMS | Meot-Ner, 1984 | gas phase |
ΔrS° | 133. | J/mol*K | PHPMS | Meot-Ner (Mautner), 1983 | gas phase |
By formula: C6H14N+ + C4H10O2 = (C6H14N+ • C4H10O2)
Bond type: Hydrogen bonds with polydentate bonding in positive ions
Quantity | Value | Units | Method | Reference | Comment |
---|---|---|---|---|---|
ΔrH° | 123. | kJ/mol | PHPMS | Meot-Ner (Mautner), 1983 | gas phase |
Quantity | Value | Units | Method | Reference | Comment |
ΔrS° | 149. | J/mol*K | PHPMS | Meot-Ner (Mautner), 1983 | gas phase |
By formula: C6H14N+ + C5H12O2 = (C6H14N+ • C5H12O2)
Bond type: Hydrogen bonds with polydentate bonding in positive ions
Quantity | Value | Units | Method | Reference | Comment |
---|---|---|---|---|---|
ΔrH° | 119. | kJ/mol | PHPMS | Meot-Ner (Mautner), 1983 | gas phase |
Quantity | Value | Units | Method | Reference | Comment |
ΔrS° | 146. | J/mol*K | PHPMS | Meot-Ner (Mautner), 1983 | gas phase |
By formula: C6H14N+ + C6H11NO3 = (C6H14N+ • C6H11NO3)
Quantity | Value | Units | Method | Reference | Comment |
---|---|---|---|---|---|
ΔrH° | 158. | kJ/mol | PHPMS | Meot-Ner (Mautner), 1988 | gas phase |
Quantity | Value | Units | Method | Reference | Comment |
ΔrS° | 171. | J/mol*K | PHPMS | Meot-Ner (Mautner), 1988 | gas phase |
(C6H14N+ • ) +
= (C6H14N+ • 2
)
By formula: (C6H14N+ • C6H11NO3) + C6H11NO3 = (C6H14N+ • 2C6H11NO3)
Quantity | Value | Units | Method | Reference | Comment |
---|---|---|---|---|---|
ΔrH° | 85.4 | kJ/mol | PHPMS | Meot-Ner (Mautner), 1988 | gas phase |
Quantity | Value | Units | Method | Reference | Comment |
ΔrS° | 123. | J/mol*K | PHPMS | Meot-Ner (Mautner), 1988 | gas phase |
By formula: C6H14N+ + C6H14O = (C6H14N+ • C6H14O)
Bond type: Hydrogen bonds of the type NH+-O between organics
Quantity | Value | Units | Method | Reference | Comment |
---|---|---|---|---|---|
ΔrH° | 106. | kJ/mol | PHPMS | Meot-Ner, 1984 | gas phase |
Quantity | Value | Units | Method | Reference | Comment |
ΔrS° | 131. | J/mol*K | PHPMS | Meot-Ner, 1984 | gas phase |
By formula: C6H14N+ + C6H14O3 = (C6H14N+ • C6H14O3)
Bond type: Hydrogen bonds with polydentate bonding in positive ions
Quantity | Value | Units | Method | Reference | Comment |
---|---|---|---|---|---|
ΔrH° | 166. | kJ/mol | PHPMS | Meot-Ner (Mautner), 1983 | gas phase; diglyme |
Quantity | Value | Units | Method | Reference | Comment |
ΔrS° | 187. | J/mol*K | PHPMS | Meot-Ner (Mautner), 1983 | gas phase; diglyme |
By formula: C6H14N+ + C8H16O4 = (C6H14N+ • C8H16O4)
Bond type: Hydrogen bonds with polydentate bonding in positive ions
Quantity | Value | Units | Method | Reference | Comment |
---|---|---|---|---|---|
ΔrH° | 156. | kJ/mol | PHPMS | Meot-Ner (Mautner), 1983 | gas phase |
Quantity | Value | Units | Method | Reference | Comment |
ΔrS° | 146. | J/mol*K | PHPMS | Meot-Ner (Mautner), 1983 | gas phase |
By formula: C6H14N+ + C8H18O4 = (C6H14N+ • C8H18O4)
Bond type: Hydrogen bonds with polydentate bonding in positive ions
Quantity | Value | Units | Method | Reference | Comment |
---|---|---|---|---|---|
ΔrH° | 181. | kJ/mol | PHPMS | Meot-Ner (Mautner), 1983 | gas phase; triglyme |
Quantity | Value | Units | Method | Reference | Comment |
ΔrS° | 183. | J/mol*K | PHPMS | Meot-Ner (Mautner), 1983 | gas phase; triglyme |
By formula: C6H14N+ + C10H20O5 = (C6H14N+ • C10H20O5)
Bond type: Hydrogen bonds with polydentate bonding in positive ions
Quantity | Value | Units | Method | Reference | Comment |
---|---|---|---|---|---|
ΔrH° | 177. | kJ/mol | PHPMS | Meot-Ner (Mautner), 1983 | gas phase |
Quantity | Value | Units | Method | Reference | Comment |
ΔrS° | 153. | J/mol*K | PHPMS | Meot-Ner (Mautner), 1983 | gas phase |
By formula: C6H14N+ + C12H24O6 = (C6H14N+ • C12H24O6)
Bond type: Hydrogen bonds with polydentate bonding in positive ions
Quantity | Value | Units | Method | Reference | Comment |
---|---|---|---|---|---|
ΔrH° | 200. ± 20. | kJ/mol | PHPMS | Meot-Ner (Mautner), 1983 | gas phase; Entropy change calculated or estimated |
Quantity | Value | Units | Method | Reference | Comment |
ΔrS° | 160. | J/mol*K | N/A | Meot-Ner (Mautner), 1983 | gas phase; Entropy change calculated or estimated |
Free energy of reaction
ΔrG° (kJ/mol) | T (K) | Method | Reference | Comment |
---|---|---|---|---|
96. | 670. | PHPMS | Meot-Ner (Mautner), 1983 | gas phase; Entropy change calculated or estimated |

References

Meot-Ner, 1984
Meot-Ner, (Mautner)M.,
The Ionic Hydrogen Bond and Ion Solvation. 1. -NH+ O-, -NH+ N- and -OH+ O- Bonds. Correlations with Proton Affinity. Deviations Due to Structural Effects,
J. Am. Chem. Soc., 1984, 106, 5, 1257, https://doi.org/10.1021/ja00317a015
. [all data]
Meot-Ner (Mautner), 1983
Meot-Ner (Mautner), M.,
The Ionic Hydrogen Bond. 3. Multiple and -CH+...O- Bonds. Complexes of Ammonium Ions with Polyethers and Crown Ethers,
J. Am. Chem. Soc., 1983, 105, 15, 4912, https://doi.org/10.1021/ja00353a012
. [all data]
Meot-Ner (Mautner), 1988
Meot-Ner (Mautner), M.,
Models for Strong Interactions in Proteins and Enzymes. 2. Interactions of Ions with the Peptide Link and Imidazole,
J. Am. Chem. Soc., 1988, 110, 10, 3075, https://doi.org/10.1021/ja00218a014
. [all data]