N-(N-Glycylglycylglycine), protonated
- Formula: C6H12N3O4+
- Molecular weight: 190.1766

Ion clustering data

Data compiled by: Michael M. Meot-Ner (Mautner) and Sharon G. Lias
Clustering reactions
C6H12N3O4+ + = (C6H12N3O4+ •
)
By formula: C6H12N3O4+ + H2O = (C6H12N3O4+ • H2O)
Bond type: Hydrogen bond (positive ion to hydride)
Free energy of reaction
ΔrG° (kJ/mol) | T (K) | Method | Reference | Comment |
---|---|---|---|---|
28. | 293. | ES/HPMS | Klassen, Blades, et al., 1995 | gas phase |
(C6H12N3O4+ • ) +
= (C6H12N3O4+ • 2
)
By formula: (C6H12N3O4+ • H2O) + H2O = (C6H12N3O4+ • 2H2O)
Bond type: Hydrogen bond (positive ion to hydride)
Free energy of reaction
ΔrG° (kJ/mol) | T (K) | Method | Reference | Comment |
---|---|---|---|---|
24. | 293. | ES/HPMS | Klassen, Blades, et al., 1995 | gas phase |

References

Klassen, Blades, et al., 1995
Klassen, J.S.; Blades, A.T.; Kebarle, P.,
Determinations of Ion-Molecule Equilibria Involving Ions Produced by Electrospray. Hydration of Protonated Amines, Diamines, and Some Small Peptides,
J. Phys. Chem., 1995, 99, 42, 15509, https://doi.org/10.1021/j100042a027
. [all data]