Hexafluorobenzene, positive ion

Ion clustering data

Data compiled by: Michael M. Meot-Ner (Mautner) and Sharon G. Lias

Clustering reactions

C6F6+ + Benzene, hexafluoro- = (C6F6+ • Benzene, hexafluoro-)

By formula: C6F6+ + C6F6 = (C6F6+ • C6F6)

Bond type: Charge transfer bond (positive ion)

Quantity Value Units Method Reference Comment
Δr30.kJ/molPHPMSHiraoka, Mizuse, et al., 1990gas phase
Quantity Value Units Method Reference Comment
Δr83.7J/mol*KPHPMSHiraoka, Mizuse, et al., 1990gas phase

Reaction thermochemistry data

Data compiled by: Michael M. Meot-Ner (Mautner) and Sharon G. Lias

Individual Reactions

C6F6+ + Benzene, hexafluoro- = (C6F6+ • Benzene, hexafluoro-)

By formula: C6F6+ + C6F6 = (C6F6+ • C6F6)

Bond type: Charge transfer bond (positive ion)

Quantity Value Units Method Reference Comment
Δr7.2kcal/molPHPMSHiraoka, Mizuse, et al., 1990gas phase
Quantity Value Units Method Reference Comment
Δr20.0cal/mol*KPHPMSHiraoka, Mizuse, et al., 1990gas phase

References

Hiraoka, Mizuse, et al., 1990
Hiraoka, K.; Mizuse, S.; Yamabe, S., Stabilities and Structures of C6F6-(C6F6) and C6F6+(C6F6), J. Phys. Chem., 1990, 94, 9, 3689, https://doi.org/10.1021/j100372a061 . [all data]