1,5-Pentanedioic acid, conjugate base
- Formula: C5H7O4-
- Molecular weight: 131.1072

Ion clustering data

Data compiled by: Michael M. Meot-Ner (Mautner) and Sharon G. Lias
Clustering reactions
(C5H7O4- • ) +
= (C5H7O4- • 2
)
By formula: (C5H7O4- • H2O) + H2O = (C5H7O4- • 2H2O)
Bond type: Hydrogen bond (negative ion to hydride)
Quantity | Value | Units | Method | Reference | Comment |
---|---|---|---|---|---|
ΔrG° | 18. | kJ/mol | ES/HPMS | Blades, Klassen, et al., 1995 | gas phase |

Reaction thermochemistry data

Data compiled by: Michael M. Meot-Ner (Mautner) and Sharon G. Lias
Individual Reactions
(C5H7O4- • ) +
= (C5H7O4- • 2
)
By formula: (C5H7O4- • H2O) + H2O = (C5H7O4- • 2H2O)
Bond type: Hydrogen bond (negative ion to hydride)
Quantity | Value | Units | Method | Reference | Comment |
---|---|---|---|---|---|
ΔrG° | 4.2 | kcal/mol | ES/HPMS | Blades, Klassen, et al., 1995 | gas phase |

References

Blades, Klassen, et al., 1995
Blades, A.T.; Klassen, J.S.; Kebarle, P.,
Free Energies of Hydration in the Gas Phase on the Anions of Some Oxo Acids of C, N, S, P, Cl and I,
J. Am. Chem. Soc., 1995, 117, 42, 10563, https://doi.org/10.1021/ja00147a019
. [all data]