1,4-Butanedioic acid, monomethyl ester, conjugate base
- Formula: C5H7O4-
- Molecular weight: 131.1072

Ion clustering data

Data compiled by: Michael M. Meot-Ner (Mautner) and Sharon G. Lias
Clustering reactions
By formula: C5H7O4- + H2O = (C5H7O4- • H2O)
Bond type: Hydrogen bond (negative ion to hydride)
Quantity | Value | Units | Method | Reference | Comment |
---|---|---|---|---|---|
ΔrG° | 35. | kJ/mol | ES/HPMS | Blades, Klassen, et al., 1995 | gas phase |
(C5H7O4- • ) +
= (C5H7O4- • 2
)
By formula: (C5H7O4- • H2O) + H2O = (C5H7O4- • 2H2O)
Bond type: Hydrogen bond (negative ion to hydride)
Quantity | Value | Units | Method | Reference | Comment |
---|---|---|---|---|---|
ΔrG° | 26. | kJ/mol | ES/HPMS | Blades, Klassen, et al., 1995 | gas phase |

Reaction thermochemistry data

Data compiled by: Michael M. Meot-Ner (Mautner) and Sharon G. Lias

Individual Reactions

(C5H7O4- • Water) + Water = (C5H7O4- • 2Water)

By formula: (C5H7O4- • H2O) + H2O = (C5H7O4- • 2H2O)

Bond type: Hydrogen bond (negative ion to hydride)

Quantity Value Units Method Reference Comment
Δr26.kJ/molES/HPMSBlades, Klassen, et al., 1995gas phase

C5H7O4- + Water = (C5H7O4- • Water)

By formula: C5H7O4- + H2O = (C5H7O4- • H2O)

Bond type: Hydrogen bond (negative ion to hydride)

Quantity Value Units Method Reference Comment
Δr35.kJ/molES/HPMSBlades, Klassen, et al., 1995gas phase

References

Blades, Klassen, et al., 1995
Blades, A.T.; Klassen, J.S.; Kebarle, P.,
Free Energies of Hydration in the Gas Phase on the Anions of Some Oxo Acids of C, N, S, P, Cl and I,
J. Am. Chem. Soc., 1995, 117, 42, 10563, https://doi.org/10.1021/ja00147a019
. [all data]