4-Nitropyridine, protonated
- Formula: C5H5N2O2+
- Molecular weight: 125.1049

Ion clustering data

Data compiled by: Michael M. Meot-Ner (Mautner) and Sharon G. Lias
Clustering reactions
By formula: C5H5N2O2+ + H2O = (C5H5N2O2+ • H2O)
Bond type: Hydrogen bond (positive ion to hydride)
Free energy of reaction
ΔrG° (kcal/mol) | T (K) | Method | Reference | Comment |
---|---|---|---|---|
5.9 | 400. | PHPMS | Davidson, Sunner J., et al., 1979 | gas phase |

Reaction thermochemistry data

Data compiled by: Michael M. Meot-Ner (Mautner) and Sharon G. Lias

Individual Reactions

C5H5N2O2+ + Water = (C5H5N2O2+ • Water)

By formula: C5H5N2O2+ + H2O = (C5H5N2O2+ • H2O)

Bond type: Hydrogen bond (positive ion to hydride)

Free energy of reaction

ΔrG° (kJ/mol) T (K) Method Reference Comment
25.400.PHPMSDavidson, Sunner J., et al., 1979gas phase

References

Davidson, Sunner J., et al., 1979
Davidson, W.R.; Sunner J.; Kebarle, P.,
Hydrogen Bonding of Water to Onium Ions. Hydration of Substituted Pyridinium Ions and Related Systems,
J. Am. Chem. Soc., 1979, 101, 7, 1675, https://doi.org/10.1021/ja00501a005
. [all data]