1,5-Diaminopentane, diprotonated
- Formula: C5H16N2+2
- Molecular weight: 104.1928

Reaction thermochemistry data

Data compiled by: Michael M. Meot-Ner (Mautner) and Sharon G. Lias
Individual Reactions
(C5H16N2+2 • ) +
= (C5H16N2+2 • 2
)
By formula: (C5H16N2+2 • H2O) + H2O = (C5H16N2+2 • 2H2O)
Bond type: Hydrogen bond (positive ion to hydride)
Quantity | Value | Units | Method | Reference | Comment |
---|---|---|---|---|---|
ΔrH° | 77.0 | kJ/mol | ES/HPMS | Blades, Klassen, et al., 1996 | gas phase; Entropy change calculated or estimated |
Quantity | Value | Units | Method | Reference | Comment |
ΔrS° | 100. | J/mol*K | N/A | Blades, Klassen, et al., 1996 | gas phase; Entropy change calculated or estimated |
Quantity | Value | Units | Method | Reference | Comment |
ΔrG° | 47.3 | kJ/mol | ES/HPMS | Blades, Klassen, et al., 1996 | gas phase; Entropy change calculated or estimated |
By formula: C5H16N2+2 + H2O = (C5H16N2+2 • H2O)
Bond type: Hydrogen bond (positive ion to hydride)
Quantity | Value | Units | Method | Reference | Comment |
---|---|---|---|---|---|
ΔrH° | 77.8 | kJ/mol | ES/HPMS | Blades, Klassen, et al., 1996 | gas phase; Entropy change calculated or estimated |
Quantity | Value | Units | Method | Reference | Comment |
ΔrS° | 90.0 | J/mol*K | N/A | Blades, Klassen, et al., 1996 | gas phase; Entropy change calculated or estimated |
Quantity | Value | Units | Method | Reference | Comment |
ΔrG° | 51.0 | kJ/mol | ES/HPMS | Blades, Klassen, et al., 1996 | gas phase; Entropy change calculated or estimated |

Ion clustering data

Data compiled by: Michael M. Meot-Ner (Mautner) and Sharon G. Lias
Clustering reactions
By formula: C5H16N2+2 + H2O = (C5H16N2+2 • H2O)
Bond type: Hydrogen bond (positive ion to hydride)
Quantity | Value | Units | Method | Reference | Comment |
---|---|---|---|---|---|
ΔrH° | 77.8 | kJ/mol | ES/HPMS | Blades, Klassen, et al., 1996 | gas phase; Entropy change calculated or estimated |
Quantity | Value | Units | Method | Reference | Comment |
ΔrS° | 90.0 | J/mol*K | N/A | Blades, Klassen, et al., 1996 | gas phase; Entropy change calculated or estimated |
Quantity | Value | Units | Method | Reference | Comment |
ΔrG° | 51.0 | kJ/mol | ES/HPMS | Blades, Klassen, et al., 1996 | gas phase; Entropy change calculated or estimated |
(C5H16N2+2 • ) +
= (C5H16N2+2 • 2
)
By formula: (C5H16N2+2 • H2O) + H2O = (C5H16N2+2 • 2H2O)
Bond type: Hydrogen bond (positive ion to hydride)
Quantity | Value | Units | Method | Reference | Comment |
---|---|---|---|---|---|
ΔrH° | 77.0 | kJ/mol | ES/HPMS | Blades, Klassen, et al., 1996 | gas phase; Entropy change calculated or estimated |
Quantity | Value | Units | Method | Reference | Comment |
ΔrS° | 100. | J/mol*K | N/A | Blades, Klassen, et al., 1996 | gas phase; Entropy change calculated or estimated |
Quantity | Value | Units | Method | Reference | Comment |
ΔrG° | 47.3 | kJ/mol | ES/HPMS | Blades, Klassen, et al., 1996 | gas phase; Entropy change calculated or estimated |

References

Blades, Klassen, et al., 1996
Blades, A.T.; Klassen, J.S.; Kebarle, P.,
Determination of Ion-Solvent Equilibria in the Gas Phase. Hydration of Diprotonated Diamines and Bis(trimethylammonium) Alkanes,
J. Am. Chem. Soc., 1996, 118, 49, 12437, https://doi.org/10.1021/ja962641t
. [all data]