1-Pentanol, protonated
- Formula: C5H13O+
- Molecular weight: 89.1556

Reaction thermochemistry data

Data compiled by: Michael M. Meot-Ner (Mautner) and Sharon G. Lias
Individual Reactions
(C5H13O+ • 4) +
= (C5H13O+ • 5
)
By formula: (C5H13O+ • 4C5H12O) + C5H12O = (C5H13O+ • 5C5H12O)
Bond type: Hydrogen bonds of the type OH-O between organics
Quantity | Value | Units | Method | Reference | Comment |
---|---|---|---|---|---|
ΔrH° | 46. | kJ/mol | PHPMS | Meot-Ner (Mautner), 1992 | gas phase; Entropy change calculated or estimated |
Quantity | Value | Units | Method | Reference | Comment |
ΔrS° | 100. | J/mol*K | N/A | Meot-Ner (Mautner), 1992 | gas phase; Entropy change calculated or estimated |
Free energy of reaction
ΔrG° (kJ/mol) | T (K) | Method | Reference | Comment |
---|---|---|---|---|
21. | 227. | PHPMS | Meot-Ner (Mautner), 1992 | gas phase; Entropy change calculated or estimated |
(C5H13O+ • ) +
= (C5H13O+ • 2
)
By formula: (C5H13O+ • C5H12O) + C5H12O = (C5H13O+ • 2C5H12O)
Bond type: Hydrogen bonds of the type OH-O between organics
Quantity | Value | Units | Method | Reference | Comment |
---|---|---|---|---|---|
ΔrH° | 92. | kJ/mol | PHPMS | Meot-Ner (Mautner), 1992 | gas phase; Entropy change calculated or estimated |
Quantity | Value | Units | Method | Reference | Comment |
ΔrS° | 130. | J/mol*K | N/A | Meot-Ner (Mautner), 1992 | gas phase; Entropy change calculated or estimated |
Free energy of reaction
ΔrG° (kJ/mol) | T (K) | Method | Reference | Comment |
---|---|---|---|---|
43.9 | 346. | PHPMS | Meot-Ner (Mautner), 1992 | gas phase; Entropy change calculated or estimated |
(C5H13O+ • 2) +
= (C5H13O+ • 3
)
By formula: (C5H13O+ • 2C5H12O) + C5H12O = (C5H13O+ • 3C5H12O)
Bond type: Hydrogen bonds of the type OH-O between organics
Quantity | Value | Units | Method | Reference | Comment |
---|---|---|---|---|---|
ΔrH° | 58.6 | kJ/mol | PHPMS | Meot-Ner (Mautner), 1992 | gas phase |
Quantity | Value | Units | Method | Reference | Comment |
ΔrS° | 102. | J/mol*K | PHPMS | Meot-Ner (Mautner), 1992 | gas phase |
(C5H13O+ • 3) +
= (C5H13O+ • 4
)
By formula: (C5H13O+ • 3C5H12O) + C5H12O = (C5H13O+ • 4C5H12O)
Bond type: Hydrogen bonds of the type OH-O between organics
Quantity | Value | Units | Method | Reference | Comment |
---|---|---|---|---|---|
ΔrH° | 49.8 | kJ/mol | PHPMS | Meot-Ner (Mautner), 1992 | gas phase |
Quantity | Value | Units | Method | Reference | Comment |
ΔrS° | 102. | J/mol*K | PHPMS | Meot-Ner (Mautner), 1992 | gas phase |

Ion clustering data

Data compiled by: Michael M. Meot-Ner (Mautner) and Sharon G. Lias
Clustering reactions
(C5H13O+ • ) +
= (C5H13O+ • 2
)
By formula: (C5H13O+ • C5H12O) + C5H12O = (C5H13O+ • 2C5H12O)
Bond type: Hydrogen bonds of the type OH-O between organics
Quantity | Value | Units | Method | Reference | Comment |
---|---|---|---|---|---|
ΔrH° | 92. | kJ/mol | PHPMS | Meot-Ner (Mautner), 1992 | gas phase; Entropy change calculated or estimated |
Quantity | Value | Units | Method | Reference | Comment |
ΔrS° | 130. | J/mol*K | N/A | Meot-Ner (Mautner), 1992 | gas phase; Entropy change calculated or estimated |
Free energy of reaction
ΔrG° (kJ/mol) | T (K) | Method | Reference | Comment |
---|---|---|---|---|
43.9 | 346. | PHPMS | Meot-Ner (Mautner), 1992 | gas phase; Entropy change calculated or estimated |
(C5H13O+ • 2) +
= (C5H13O+ • 3
)
By formula: (C5H13O+ • 2C5H12O) + C5H12O = (C5H13O+ • 3C5H12O)
Bond type: Hydrogen bonds of the type OH-O between organics
Quantity | Value | Units | Method | Reference | Comment |
---|---|---|---|---|---|
ΔrH° | 58.6 | kJ/mol | PHPMS | Meot-Ner (Mautner), 1992 | gas phase |
Quantity | Value | Units | Method | Reference | Comment |
ΔrS° | 102. | J/mol*K | PHPMS | Meot-Ner (Mautner), 1992 | gas phase |
(C5H13O+ • 3) +
= (C5H13O+ • 4
)
By formula: (C5H13O+ • 3C5H12O) + C5H12O = (C5H13O+ • 4C5H12O)
Bond type: Hydrogen bonds of the type OH-O between organics
Quantity | Value | Units | Method | Reference | Comment |
---|---|---|---|---|---|
ΔrH° | 49.8 | kJ/mol | PHPMS | Meot-Ner (Mautner), 1992 | gas phase |
Quantity | Value | Units | Method | Reference | Comment |
ΔrS° | 102. | J/mol*K | PHPMS | Meot-Ner (Mautner), 1992 | gas phase |
(C5H13O+ • 4) +
= (C5H13O+ • 5
)
By formula: (C5H13O+ • 4C5H12O) + C5H12O = (C5H13O+ • 5C5H12O)
Bond type: Hydrogen bonds of the type OH-O between organics
Quantity | Value | Units | Method | Reference | Comment |
---|---|---|---|---|---|
ΔrH° | 46. | kJ/mol | PHPMS | Meot-Ner (Mautner), 1992 | gas phase; Entropy change calculated or estimated |
Quantity | Value | Units | Method | Reference | Comment |
ΔrS° | 100. | J/mol*K | N/A | Meot-Ner (Mautner), 1992 | gas phase; Entropy change calculated or estimated |
Free energy of reaction
ΔrG° (kJ/mol) | T (K) | Method | Reference | Comment |
---|---|---|---|---|
21. | 227. | PHPMS | Meot-Ner (Mautner), 1992 | gas phase; Entropy change calculated or estimated |

References

Meot-Ner (Mautner), 1992
Meot-Ner (Mautner), M.,
Intermolecular Forces in Organic Clusters,
J. Am. Chem. Soc., 1992, 114, 9, 3312, https://doi.org/10.1021/ja00035a024
. [all data]