Cytosine, protonated
- Formula: C4H6N3O+
- Molecular weight: 112.1094

Reaction thermochemistry data

Data compiled by: Michael M. Meot-Ner (Mautner) and Sharon G. Lias
Individual Reactions
By formula: C4H6N3O+ + C4H5N3O = (C4H6N3O+ • C4H5N3O)
Quantity | Value | Units | Method | Reference | Comment |
---|---|---|---|---|---|
ΔrH° | 38.3 | kcal/mol | PHPMS | Meot-Ner (Mautner), 1979 | gas phase |
Quantity | Value | Units | Method | Reference | Comment |
ΔrS° | 37. | cal/mol*K | PHPMS | Meot-Ner (Mautner), 1979 | gas phase |

Ion clustering data

Data compiled by: Michael M. Meot-Ner (Mautner) and Sharon G. Lias
Clustering reactions
By formula: C4H6N3O+ + C4H5N3O = (C4H6N3O+ • C4H5N3O)
Quantity | Value | Units | Method | Reference | Comment |
---|---|---|---|---|---|
ΔrH° | 38.3 | kcal/mol | PHPMS | Meot-Ner (Mautner), 1979 | gas phase |
Quantity | Value | Units | Method | Reference | Comment |
ΔrS° | 37. | cal/mol*K | PHPMS | Meot-Ner (Mautner), 1979 | gas phase |

References

Meot-Ner (Mautner), 1979
Meot-Ner (Mautner), M.,
Ion Thermochemistry of Low Volatility Compounds in the Gas Phase. II. Intrinsic Basicities and Hydrogen Bonded Dimers of Nitrogen Heterocyclics and Nucleic Bases,
J. Am. Chem. Soc., 1979, 101, 9, 2396, https://doi.org/10.1021/ja00503a027
. [all data]