Furan, positive ion

Reaction thermochemistry data

Data compiled by: Michael M. Meot-Ner (Mautner) and Sharon G. Lias

Individual Reactions

C4H4O+ + Water = (C4H4O+ • Water)

By formula: C4H4O+ + H2O = (C4H4O+ • H2O)

Quantity Value Units Method Reference Comment
Δr41.kJ/molPHPMSHiraoka, Takimoto, et al., 1987gas phase
Quantity Value Units Method Reference Comment
Δr74.5J/mol*KPHPMSHiraoka, Takimoto, et al., 1987gas phase

C4H4O+ + Furan = (C4H4O+ • Furan)

By formula: C4H4O+ + C4H4O = (C4H4O+ • C4H4O)

Quantity Value Units Method Reference Comment
Δr72.0kJ/molPHPMSHiraoka, Takimoto, et al., 1987gas phase
Quantity Value Units Method Reference Comment
Δr99.2J/mol*KPHPMSHiraoka, Takimoto, et al., 1987gas phase

(C4H4O+ • Furan) + Furan = (C4H4O+ • 2Furan)

By formula: (C4H4O+ • C4H4O) + C4H4O = (C4H4O+ • 2C4H4O)

Quantity Value Units Method Reference Comment
Δr30.kJ/molPHPMSHiraoka, Takimoto, et al., 1987gas phase; ΔrH<

Ion clustering data

Data compiled by: Michael M. Meot-Ner (Mautner) and Sharon G. Lias

Clustering reactions

C4H4O+ + Furan = (C4H4O+ • Furan)

By formula: C4H4O+ + C4H4O = (C4H4O+ • C4H4O)

Quantity Value Units Method Reference Comment
Δr72.0kJ/molPHPMSHiraoka, Takimoto, et al., 1987gas phase
Quantity Value Units Method Reference Comment
Δr99.2J/mol*KPHPMSHiraoka, Takimoto, et al., 1987gas phase

(C4H4O+ • Furan) + Furan = (C4H4O+ • 2Furan)

By formula: (C4H4O+ • C4H4O) + C4H4O = (C4H4O+ • 2C4H4O)

Quantity Value Units Method Reference Comment
Δr30.kJ/molPHPMSHiraoka, Takimoto, et al., 1987gas phase; ΔrH<

C4H4O+ + Water = (C4H4O+ • Water)

By formula: C4H4O+ + H2O = (C4H4O+ • H2O)

Quantity Value Units Method Reference Comment
Δr41.kJ/molPHPMSHiraoka, Takimoto, et al., 1987gas phase
Quantity Value Units Method Reference Comment
Δr74.5J/mol*KPHPMSHiraoka, Takimoto, et al., 1987gas phase

References

Hiraoka, Takimoto, et al., 1987
Hiraoka, K.; Takimoto, H.; Yamabe, S., Stabilities and Structures in Cluster Ions of Five-Membered Heterocyclic Compounds Containing O, N and S Atoms, J. Am. Chem. Soc., 1987, 109, 24, 7346, https://doi.org/10.1021/ja00258a018 . [all data]