Tetramethylhydrazine, positive ion
- Formula: C4H12N2+
- Molecular weight: 88.1509

Reaction thermochemistry data

Data compiled by: Michael M. Meot-Ner (Mautner) and Sharon G. Lias
Individual Reactions
By formula: C4H12N2+ + C4H12N2 = (C4H12N2+ • C4H12N2)
Bond type: Charge transfer bond (positive ion)
Quantity | Value | Units | Method | Reference | Comment |
---|---|---|---|---|---|
ΔrH° | 13.0 | kcal/mol | PHPMS | Nelsen, Rumak, et al., 1987 | gas phase |
Quantity | Value | Units | Method | Reference | Comment |
ΔrS° | 26.8 | cal/mol*K | PHPMS | Nelsen, Rumak, et al., 1987 | gas phase |

Ion clustering data

Data compiled by: Michael M. Meot-Ner (Mautner) and Sharon G. Lias
Clustering reactions
By formula: C4H12N2+ + C4H12N2 = (C4H12N2+ • C4H12N2)
Bond type: Charge transfer bond (positive ion)
Quantity | Value | Units | Method | Reference | Comment |
---|---|---|---|---|---|
ΔrH° | 13.0 | kcal/mol | PHPMS | Nelsen, Rumak, et al., 1987 | gas phase |
Quantity | Value | Units | Method | Reference | Comment |
ΔrS° | 26.8 | cal/mol*K | PHPMS | Nelsen, Rumak, et al., 1987 | gas phase |

References

Nelsen, Rumak, et al., 1987
Nelsen, S.F.; Rumak, D.T.; Meot-Ner (Mautner), M.,
Kinetic effects of an unusually large neutral to radical cation geometry change. Slow electron transfer rections between alkylhydrazines,
J. Am. Chem. Soc., 1987, 109, 5, 1373, https://doi.org/10.1021/ja00239a015
. [all data]