1,2,4-Butanetriol, protonated
- Formula: C4H11O3+
- Molecular weight: 107.1278

Reaction thermochemistry data

Data compiled by: Michael M. Meot-Ner (Mautner) and Sharon G. Lias
Individual Reactions
By formula: C4H11O3+ + C4H10O3 = (C4H11O3+ • C4H10O3)
Bond type: Hydrogen bonds of the type OH-O between organics
Free energy of reaction
ΔrG° (kJ/mol) | T (K) | Method | Reference | Comment |
---|---|---|---|---|
57.3 | 500. | PHPMS | Sunner, Kulatunga, et al., 1986 | gas phase |

Ion clustering data

Data compiled by: Michael M. Meot-Ner (Mautner) and Sharon G. Lias
Clustering reactions
By formula: C4H11O3+ + C4H10O3 = (C4H11O3+ • C4H10O3)
Bond type: Hydrogen bonds of the type OH-O between organics
Free energy of reaction
ΔrG° (kJ/mol) | T (K) | Method | Reference | Comment |
---|---|---|---|---|
57.3 | 500. | PHPMS | Sunner, Kulatunga, et al., 1986 | gas phase |

References

Sunner, Kulatunga, et al., 1986
Sunner, J.A.; Kulatunga, R.; Kebarle, P.,
Fast Atom Bombardment Mass Spectrometry and Gas Phase Basicities,
Anal. Chem., 1986, 58, 7, 1312, https://doi.org/10.1021/ac00298a010
. [all data]