Ethane, 1,2-dimethoxy-, protonated
- Formula: C4H11O2+
- Molecular weight: 91.1284

Reaction thermochemistry data

Data compiled by: Michael M. Meot-Ner (Mautner) and Sharon G. Lias
Individual Reactions
(C4H11O2+ • 2 • 2
) +
= (C4H11O2+ • 3
• 2
)
By formula: (C4H11O2+ • 2H2O • 2C4H10O2) + H2O = (C4H11O2+ • 3H2O • 2C4H10O2)
Bond type: Hydrogen bond (positive ion to hydride)
Quantity | Value | Units | Method | Reference | Comment |
---|---|---|---|---|---|
ΔrH° | 38. | kJ/mol | PHPMS | Meot-Ner (Mautner), Sieck, et al., 1994 | gas phase; Entropy change calculated or estimated |
Quantity | Value | Units | Method | Reference | Comment |
ΔrS° | 105. | J/mol*K | N/A | Meot-Ner (Mautner), Sieck, et al., 1994 | gas phase; Entropy change calculated or estimated |
Free energy of reaction
ΔrG° (kJ/mol) | T (K) | Method | Reference | Comment |
---|---|---|---|---|
15. | 225. | PHPMS | Meot-Ner (Mautner), Sieck, et al., 1994 | gas phase; Entropy change calculated or estimated |
(C4H11O2+ • 3 •
) +
= (C4H11O2+ • 4
•
)
By formula: (C4H11O2+ • 3H2O • C4H10O2) + H2O = (C4H11O2+ • 4H2O • C4H10O2)
Bond type: Hydrogen bond (positive ion to hydride)
Quantity | Value | Units | Method | Reference | Comment |
---|---|---|---|---|---|
ΔrH° | 40. | kJ/mol | PHPMS | Meot-Ner (Mautner), Sieck, et al., 1994 | gas phase; Entropy change calculated or estimated |
Quantity | Value | Units | Method | Reference | Comment |
ΔrS° | 105. | J/mol*K | N/A | Meot-Ner (Mautner), Sieck, et al., 1994 | gas phase; Entropy change calculated or estimated |
Free energy of reaction
ΔrG° (kJ/mol) | T (K) | Method | Reference | Comment |
---|---|---|---|---|
16. | 225. | PHPMS | Meot-Ner (Mautner), Sieck, et al., 1994 | gas phase; Entropy change calculated or estimated |
(C4H11O2+ • 2) +
= (C4H11O2+ • 3
)
By formula: (C4H11O2+ • 2C4H10O2) + C4H10O2 = (C4H11O2+ • 3C4H10O2)
Bond type: Hydrogen bonds between protonated and neutral organics
Quantity | Value | Units | Method | Reference | Comment |
---|---|---|---|---|---|
ΔrH° | 42.7 | kJ/mol | PHPMS | Meot-Ner (Mautner), Sieck, et al., 1994 | gas phase; Entropy change calculated or estimated |
Quantity | Value | Units | Method | Reference | Comment |
ΔrS° | 105. | J/mol*K | N/A | Meot-Ner (Mautner), Sieck, et al., 1994 | gas phase; Entropy change calculated or estimated |
Free energy of reaction
ΔrG° (kJ/mol) | T (K) | Method | Reference | Comment |
---|---|---|---|---|
21. | 208. | PHPMS | Meot-Ner (Mautner), Sieck, et al., 1994 | gas phase; Entropy change calculated or estimated |
(C4H11O2+ • • 2
) +
= (C4H11O2+ • 2
• 2
)
By formula: (C4H11O2+ • C4H10O2 • 2H2O) + C4H10O2 = (C4H11O2+ • 2C4H10O2 • 2H2O)
Bond type: Hydrogen bonds between protonated and neutral organics
Quantity | Value | Units | Method | Reference | Comment |
---|---|---|---|---|---|
ΔrH° | 82.8 | kJ/mol | PHPMS | Meot-Ner (Mautner), Sieck, et al., 1994 | gas phase |
Quantity | Value | Units | Method | Reference | Comment |
ΔrS° | 123. | J/mol*K | PHPMS | Meot-Ner (Mautner), Sieck, et al., 1994 | gas phase |
(C4H11O2+ • 2 •
) +
= (C4H11O2+ • 3
•
)
By formula: (C4H11O2+ • 2H2O • C4H10O2) + H2O = (C4H11O2+ • 3H2O • C4H10O2)
Bond type: Hydrogen bond (positive ion to hydride)
Quantity | Value | Units | Method | Reference | Comment |
---|---|---|---|---|---|
ΔrH° | 42.7 | kJ/mol | PHPMS | Meot-Ner (Mautner), Sieck, et al., 1994 | gas phase |
Quantity | Value | Units | Method | Reference | Comment |
ΔrS° | 104. | J/mol*K | PHPMS | Meot-Ner (Mautner), Sieck, et al., 1994 | gas phase |
(C4H11O2+ • • 2
) +
= (C4H11O2+ • 2
• 2
)
By formula: (C4H11O2+ • H2O • 2C4H10O2) + H2O = (C4H11O2+ • 2H2O • 2C4H10O2)
Bond type: Hydrogen bond (positive ion to hydride)
Quantity | Value | Units | Method | Reference | Comment |
---|---|---|---|---|---|
ΔrH° | 41. | kJ/mol | PHPMS | Meot-Ner (Mautner), Sieck, et al., 1994 | gas phase |
Quantity | Value | Units | Method | Reference | Comment |
ΔrS° | 102. | J/mol*K | PHPMS | Meot-Ner (Mautner), Sieck, et al., 1994 | gas phase |
(C4H11O2+ • •
) +
= (C4H11O2+ • 2
•
)
By formula: (C4H11O2+ • H2O • C4H10O2) + H2O = (C4H11O2+ • 2H2O • C4H10O2)
Bond type: Hydrogen bond (positive ion to hydride)
Quantity | Value | Units | Method | Reference | Comment |
---|---|---|---|---|---|
ΔrH° | 43.5 | kJ/mol | PHPMS | Meot-Ner (Mautner), Sieck, et al., 1994 | gas phase |
Quantity | Value | Units | Method | Reference | Comment |
ΔrS° | 104. | J/mol*K | PHPMS | Meot-Ner (Mautner), Sieck, et al., 1994 | gas phase |
(C4H11O2+ • 2) +
= (C4H11O2+ • 3
)
By formula: (C4H11O2+ • 2CH4O) + CH4O = (C4H11O2+ • 3CH4O)
Bond type: Hydrogen bonds between protonated and neutral organics
Quantity | Value | Units | Method | Reference | Comment |
---|---|---|---|---|---|
ΔrH° | 52.7 | kJ/mol | PHPMS | Meot-Ner (Mautner), Sieck, et al., 1994 | gas phase |
Quantity | Value | Units | Method | Reference | Comment |
ΔrS° | 105. | J/mol*K | PHPMS | Meot-Ner (Mautner), Sieck, et al., 1994 | gas phase |
(C4H11O2+ • 3) +
= (C4H11O2+ • 4
)
By formula: (C4H11O2+ • 3CH4O) + CH4O = (C4H11O2+ • 4CH4O)
Bond type: Hydrogen bonds between protonated and neutral organics
Quantity | Value | Units | Method | Reference | Comment |
---|---|---|---|---|---|
ΔrH° | 42.7 | kJ/mol | PHPMS | Meot-Ner (Mautner), Sieck, et al., 1994 | gas phase |
Quantity | Value | Units | Method | Reference | Comment |
ΔrS° | 93.3 | J/mol*K | PHPMS | Meot-Ner (Mautner), Sieck, et al., 1994 | gas phase |
(C4H11O2+ • 4) +
= (C4H11O2+ • 5
)
By formula: (C4H11O2+ • 4CH4O) + CH4O = (C4H11O2+ • 5CH4O)
Bond type: Hydrogen bonds between protonated and neutral organics
Quantity | Value | Units | Method | Reference | Comment |
---|---|---|---|---|---|
ΔrH° | 38. | kJ/mol | PHPMS | Meot-Ner (Mautner), Sieck, et al., 1994 | gas phase |
Quantity | Value | Units | Method | Reference | Comment |
ΔrS° | 92.9 | J/mol*K | PHPMS | Meot-Ner (Mautner), Sieck, et al., 1994 | gas phase |
(C4H11O2+ • 5) +
= (C4H11O2+ • 6
)
By formula: (C4H11O2+ • 5CH4O) + CH4O = (C4H11O2+ • 6CH4O)
Bond type: Hydrogen bonds between protonated and neutral organics
Quantity | Value | Units | Method | Reference | Comment |
---|---|---|---|---|---|
ΔrH° | 37. | kJ/mol | PHPMS | Meot-Ner (Mautner), Sieck, et al., 1994 | gas phase |
Quantity | Value | Units | Method | Reference | Comment |
ΔrS° | 100. | J/mol*K | PHPMS | Meot-Ner (Mautner), Sieck, et al., 1994 | gas phase |
(C4H11O2+ • ) +
= (C4H11O2+ • 2
)
By formula: (C4H11O2+ • CH4O) + CH4O = (C4H11O2+ • 2CH4O)
Bond type: Hydrogen bonds between protonated and neutral organics
Quantity | Value | Units | Method | Reference | Comment |
---|---|---|---|---|---|
ΔrH° | 60.2 | kJ/mol | PHPMS | Meot-Ner (Mautner), Sieck, et al., 1994 | gas phase |
Quantity | Value | Units | Method | Reference | Comment |
ΔrS° | 98.7 | J/mol*K | PHPMS | Meot-Ner (Mautner), Sieck, et al., 1994 | gas phase |
(C4H11O2+ • ) +
= (C4H11O2+ •
•
)
By formula: (C4H11O2+ • C4H10O2) + H2O = (C4H11O2+ • H2O • C4H10O2)
Bond type: Hydrogen bond (positive ion to hydride)
Quantity | Value | Units | Method | Reference | Comment |
---|---|---|---|---|---|
ΔrH° | 57.3 | kJ/mol | PHPMS | Meot-Ner (Mautner), Sieck, et al., 1994 | gas phase |
Quantity | Value | Units | Method | Reference | Comment |
ΔrS° | 115. | J/mol*K | PHPMS | Meot-Ner (Mautner), Sieck, et al., 1994 | gas phase |
By formula: C4H11O2+ + C4H10O2 = (C4H11O2+ • C4H10O2)
Bond type: Hydrogen bonds between protonated and neutral organics
Quantity | Value | Units | Method | Reference | Comment |
---|---|---|---|---|---|
ΔrH° | 115. | kJ/mol | PHPMS | Meot-Ner (Mautner), Sieck, et al., 1994 | gas phase |
Quantity | Value | Units | Method | Reference | Comment |
ΔrS° | 129. | J/mol*K | PHPMS | Meot-Ner (Mautner), Sieck, et al., 1994 | gas phase |
(C4H11O2+ • 2) +
= (C4H11O2+ • 3
)
By formula: (C4H11O2+ • 2H2O) + H2O = (C4H11O2+ • 3H2O)
Bond type: Hydrogen bond (positive ion to hydride)
Quantity | Value | Units | Method | Reference | Comment |
---|---|---|---|---|---|
ΔrH° | 47.3 | kJ/mol | PHPMS | Meot-Ner (Mautner), Sieck, et al., 1994 | gas phase |
Quantity | Value | Units | Method | Reference | Comment |
ΔrS° | 94.1 | J/mol*K | PHPMS | Meot-Ner (Mautner), Sieck, et al., 1994 | gas phase |
(C4H11O2+ • 3) +
= (C4H11O2+ • 4
)
By formula: (C4H11O2+ • 3H2O) + H2O = (C4H11O2+ • 4H2O)
Bond type: Hydrogen bond (positive ion to hydride)
Quantity | Value | Units | Method | Reference | Comment |
---|---|---|---|---|---|
ΔrH° | 45.2 | kJ/mol | PHPMS | Meot-Ner (Mautner), Sieck, et al., 1994 | gas phase |
Quantity | Value | Units | Method | Reference | Comment |
ΔrS° | 100. | J/mol*K | PHPMS | Meot-Ner (Mautner), Sieck, et al., 1994 | gas phase |
(C4H11O2+ • 4) +
= (C4H11O2+ • 5
)
By formula: (C4H11O2+ • 4H2O) + H2O = (C4H11O2+ • 5H2O)
Bond type: Hydrogen bond (positive ion to hydride)
Quantity | Value | Units | Method | Reference | Comment |
---|---|---|---|---|---|
ΔrH° | 42.7 | kJ/mol | PHPMS | Meot-Ner (Mautner), Sieck, et al., 1994 | gas phase |
Quantity | Value | Units | Method | Reference | Comment |
ΔrS° | 105. | J/mol*K | PHPMS | Meot-Ner (Mautner), Sieck, et al., 1994 | gas phase |
(C4H11O2+ • ) +
= (C4H11O2+ • 2
)
By formula: (C4H11O2+ • H2O) + H2O = (C4H11O2+ • 2H2O)
Bond type: Hydrogen bond (positive ion to hydride)
Quantity | Value | Units | Method | Reference | Comment |
---|---|---|---|---|---|
ΔrH° | 65.7 | kJ/mol | PHPMS | Meot-Ner (Mautner), Sieck, et al., 1994 | gas phase |
Quantity | Value | Units | Method | Reference | Comment |
ΔrS° | 120. | J/mol*K | PHPMS | Meot-Ner (Mautner), Sieck, et al., 1994 | gas phase |
By formula: C4H11O2+ + CH4O = (C4H11O2+ • CH4O)
Bond type: Hydrogen bonds between protonated and neutral organics
Quantity | Value | Units | Method | Reference | Comment |
---|---|---|---|---|---|
ΔrH° | 92.0 | kJ/mol | PHPMS | Meot-Ner (Mautner), Sieck, et al., 1994 | gas phase |
Quantity | Value | Units | Method | Reference | Comment |
ΔrS° | 118. | J/mol*K | PHPMS | Meot-Ner (Mautner), Sieck, et al., 1994 | gas phase |
By formula: C4H11O2+ + H2O = (C4H11O2+ • H2O)
Bond type: Hydrogen bond (positive ion to hydride)
Quantity | Value | Units | Method | Reference | Comment |
---|---|---|---|---|---|
ΔrH° | 68.6 | kJ/mol | PHPMS | Meot-Ner (Mautner), Sieck, et al., 1994 | gas phase |
Quantity | Value | Units | Method | Reference | Comment |
ΔrS° | 103. | J/mol*K | PHPMS | Meot-Ner (Mautner), Sieck, et al., 1994 | gas phase |

Ion clustering data

Data compiled by: Michael M. Meot-Ner (Mautner) and Sharon G. Lias
Clustering reactions
By formula: C4H11O2+ + CH4O = (C4H11O2+ • CH4O)
Bond type: Hydrogen bonds between protonated and neutral organics
Quantity | Value | Units | Method | Reference | Comment |
---|---|---|---|---|---|
ΔrH° | 92.0 | kJ/mol | PHPMS | Meot-Ner (Mautner), Sieck, et al., 1994 | gas phase |
Quantity | Value | Units | Method | Reference | Comment |
ΔrS° | 118. | J/mol*K | PHPMS | Meot-Ner (Mautner), Sieck, et al., 1994 | gas phase |
(C4H11O2+ • ) +
= (C4H11O2+ • 2
)
By formula: (C4H11O2+ • CH4O) + CH4O = (C4H11O2+ • 2CH4O)
Bond type: Hydrogen bonds between protonated and neutral organics
Quantity | Value | Units | Method | Reference | Comment |
---|---|---|---|---|---|
ΔrH° | 60.2 | kJ/mol | PHPMS | Meot-Ner (Mautner), Sieck, et al., 1994 | gas phase |
Quantity | Value | Units | Method | Reference | Comment |
ΔrS° | 98.7 | J/mol*K | PHPMS | Meot-Ner (Mautner), Sieck, et al., 1994 | gas phase |
(C4H11O2+ • 2) +
= (C4H11O2+ • 3
)
By formula: (C4H11O2+ • 2CH4O) + CH4O = (C4H11O2+ • 3CH4O)
Bond type: Hydrogen bonds between protonated and neutral organics
Quantity | Value | Units | Method | Reference | Comment |
---|---|---|---|---|---|
ΔrH° | 52.7 | kJ/mol | PHPMS | Meot-Ner (Mautner), Sieck, et al., 1994 | gas phase |
Quantity | Value | Units | Method | Reference | Comment |
ΔrS° | 105. | J/mol*K | PHPMS | Meot-Ner (Mautner), Sieck, et al., 1994 | gas phase |
(C4H11O2+ • 3) +
= (C4H11O2+ • 4
)
By formula: (C4H11O2+ • 3CH4O) + CH4O = (C4H11O2+ • 4CH4O)
Bond type: Hydrogen bonds between protonated and neutral organics
Quantity | Value | Units | Method | Reference | Comment |
---|---|---|---|---|---|
ΔrH° | 42.7 | kJ/mol | PHPMS | Meot-Ner (Mautner), Sieck, et al., 1994 | gas phase |
Quantity | Value | Units | Method | Reference | Comment |
ΔrS° | 93.3 | J/mol*K | PHPMS | Meot-Ner (Mautner), Sieck, et al., 1994 | gas phase |
(C4H11O2+ • 4) +
= (C4H11O2+ • 5
)
By formula: (C4H11O2+ • 4CH4O) + CH4O = (C4H11O2+ • 5CH4O)
Bond type: Hydrogen bonds between protonated and neutral organics
Quantity | Value | Units | Method | Reference | Comment |
---|---|---|---|---|---|
ΔrH° | 38. | kJ/mol | PHPMS | Meot-Ner (Mautner), Sieck, et al., 1994 | gas phase |
Quantity | Value | Units | Method | Reference | Comment |
ΔrS° | 92.9 | J/mol*K | PHPMS | Meot-Ner (Mautner), Sieck, et al., 1994 | gas phase |
(C4H11O2+ • 5) +
= (C4H11O2+ • 6
)
By formula: (C4H11O2+ • 5CH4O) + CH4O = (C4H11O2+ • 6CH4O)
Bond type: Hydrogen bonds between protonated and neutral organics
Quantity | Value | Units | Method | Reference | Comment |
---|---|---|---|---|---|
ΔrH° | 37. | kJ/mol | PHPMS | Meot-Ner (Mautner), Sieck, et al., 1994 | gas phase |
Quantity | Value | Units | Method | Reference | Comment |
ΔrS° | 100. | J/mol*K | PHPMS | Meot-Ner (Mautner), Sieck, et al., 1994 | gas phase |
By formula: C4H11O2+ + C4H10O2 = (C4H11O2+ • C4H10O2)
Bond type: Hydrogen bonds between protonated and neutral organics
Quantity | Value | Units | Method | Reference | Comment |
---|---|---|---|---|---|
ΔrH° | 115. | kJ/mol | PHPMS | Meot-Ner (Mautner), Sieck, et al., 1994 | gas phase |
Quantity | Value | Units | Method | Reference | Comment |
ΔrS° | 129. | J/mol*K | PHPMS | Meot-Ner (Mautner), Sieck, et al., 1994 | gas phase |
(C4H11O2+ • 2) +
= (C4H11O2+ • 3
)
By formula: (C4H11O2+ • 2C4H10O2) + C4H10O2 = (C4H11O2+ • 3C4H10O2)
Bond type: Hydrogen bonds between protonated and neutral organics
Quantity | Value | Units | Method | Reference | Comment |
---|---|---|---|---|---|
ΔrH° | 42.7 | kJ/mol | PHPMS | Meot-Ner (Mautner), Sieck, et al., 1994 | gas phase; Entropy change calculated or estimated |
Quantity | Value | Units | Method | Reference | Comment |
ΔrS° | 105. | J/mol*K | N/A | Meot-Ner (Mautner), Sieck, et al., 1994 | gas phase; Entropy change calculated or estimated |
Free energy of reaction
ΔrG° (kJ/mol) | T (K) | Method | Reference | Comment |
---|---|---|---|---|
21. | 208. | PHPMS | Meot-Ner (Mautner), Sieck, et al., 1994 | gas phase; Entropy change calculated or estimated |
(C4H11O2+ • ) +
= (C4H11O2+ •
•
)
By formula: (C4H11O2+ • C4H10O2) + H2O = (C4H11O2+ • H2O • C4H10O2)
Bond type: Hydrogen bond (positive ion to hydride)
Quantity | Value | Units | Method | Reference | Comment |
---|---|---|---|---|---|
ΔrH° | 57.3 | kJ/mol | PHPMS | Meot-Ner (Mautner), Sieck, et al., 1994 | gas phase |
Quantity | Value | Units | Method | Reference | Comment |
ΔrS° | 115. | J/mol*K | PHPMS | Meot-Ner (Mautner), Sieck, et al., 1994 | gas phase |
(C4H11O2+ • • 2
) +
= (C4H11O2+ • 2
• 2
)
By formula: (C4H11O2+ • C4H10O2 • 2H2O) + C4H10O2 = (C4H11O2+ • 2C4H10O2 • 2H2O)
Bond type: Hydrogen bonds between protonated and neutral organics
Quantity | Value | Units | Method | Reference | Comment |
---|---|---|---|---|---|
ΔrH° | 82.8 | kJ/mol | PHPMS | Meot-Ner (Mautner), Sieck, et al., 1994 | gas phase |
Quantity | Value | Units | Method | Reference | Comment |
ΔrS° | 123. | J/mol*K | PHPMS | Meot-Ner (Mautner), Sieck, et al., 1994 | gas phase |
By formula: C4H11O2+ + H2O = (C4H11O2+ • H2O)
Bond type: Hydrogen bond (positive ion to hydride)
Quantity | Value | Units | Method | Reference | Comment |
---|---|---|---|---|---|
ΔrH° | 68.6 | kJ/mol | PHPMS | Meot-Ner (Mautner), Sieck, et al., 1994 | gas phase |
Quantity | Value | Units | Method | Reference | Comment |
ΔrS° | 103. | J/mol*K | PHPMS | Meot-Ner (Mautner), Sieck, et al., 1994 | gas phase |
(C4H11O2+ • •
) +
= (C4H11O2+ • 2
•
)
By formula: (C4H11O2+ • H2O • C4H10O2) + H2O = (C4H11O2+ • 2H2O • C4H10O2)
Bond type: Hydrogen bond (positive ion to hydride)
Quantity | Value | Units | Method | Reference | Comment |
---|---|---|---|---|---|
ΔrH° | 43.5 | kJ/mol | PHPMS | Meot-Ner (Mautner), Sieck, et al., 1994 | gas phase |
Quantity | Value | Units | Method | Reference | Comment |
ΔrS° | 104. | J/mol*K | PHPMS | Meot-Ner (Mautner), Sieck, et al., 1994 | gas phase |
(C4H11O2+ • • 2
) +
= (C4H11O2+ • 2
• 2
)
By formula: (C4H11O2+ • H2O • 2C4H10O2) + H2O = (C4H11O2+ • 2H2O • 2C4H10O2)
Bond type: Hydrogen bond (positive ion to hydride)
Quantity | Value | Units | Method | Reference | Comment |
---|---|---|---|---|---|
ΔrH° | 41. | kJ/mol | PHPMS | Meot-Ner (Mautner), Sieck, et al., 1994 | gas phase |
Quantity | Value | Units | Method | Reference | Comment |
ΔrS° | 102. | J/mol*K | PHPMS | Meot-Ner (Mautner), Sieck, et al., 1994 | gas phase |
(C4H11O2+ • 2 •
) +
= (C4H11O2+ • 3
•
)
By formula: (C4H11O2+ • 2H2O • C4H10O2) + H2O = (C4H11O2+ • 3H2O • C4H10O2)
Bond type: Hydrogen bond (positive ion to hydride)
Quantity | Value | Units | Method | Reference | Comment |
---|---|---|---|---|---|
ΔrH° | 42.7 | kJ/mol | PHPMS | Meot-Ner (Mautner), Sieck, et al., 1994 | gas phase |
Quantity | Value | Units | Method | Reference | Comment |
ΔrS° | 104. | J/mol*K | PHPMS | Meot-Ner (Mautner), Sieck, et al., 1994 | gas phase |
(C4H11O2+ • 2 • 2
) +
= (C4H11O2+ • 3
• 2
)
By formula: (C4H11O2+ • 2H2O • 2C4H10O2) + H2O = (C4H11O2+ • 3H2O • 2C4H10O2)
Bond type: Hydrogen bond (positive ion to hydride)
Quantity | Value | Units | Method | Reference | Comment |
---|---|---|---|---|---|
ΔrH° | 38. | kJ/mol | PHPMS | Meot-Ner (Mautner), Sieck, et al., 1994 | gas phase; Entropy change calculated or estimated |
Quantity | Value | Units | Method | Reference | Comment |
ΔrS° | 105. | J/mol*K | N/A | Meot-Ner (Mautner), Sieck, et al., 1994 | gas phase; Entropy change calculated or estimated |
Free energy of reaction
ΔrG° (kJ/mol) | T (K) | Method | Reference | Comment |
---|---|---|---|---|
15. | 225. | PHPMS | Meot-Ner (Mautner), Sieck, et al., 1994 | gas phase; Entropy change calculated or estimated |
(C4H11O2+ • 3 •
) +
= (C4H11O2+ • 4
•
)
By formula: (C4H11O2+ • 3H2O • C4H10O2) + H2O = (C4H11O2+ • 4H2O • C4H10O2)
Bond type: Hydrogen bond (positive ion to hydride)
Quantity | Value | Units | Method | Reference | Comment |
---|---|---|---|---|---|
ΔrH° | 40. | kJ/mol | PHPMS | Meot-Ner (Mautner), Sieck, et al., 1994 | gas phase; Entropy change calculated or estimated |
Quantity | Value | Units | Method | Reference | Comment |
ΔrS° | 105. | J/mol*K | N/A | Meot-Ner (Mautner), Sieck, et al., 1994 | gas phase; Entropy change calculated or estimated |
Free energy of reaction
ΔrG° (kJ/mol) | T (K) | Method | Reference | Comment |
---|---|---|---|---|
16. | 225. | PHPMS | Meot-Ner (Mautner), Sieck, et al., 1994 | gas phase; Entropy change calculated or estimated |
(C4H11O2+ • ) +
= (C4H11O2+ • 2
)
By formula: (C4H11O2+ • H2O) + H2O = (C4H11O2+ • 2H2O)
Bond type: Hydrogen bond (positive ion to hydride)
Quantity | Value | Units | Method | Reference | Comment |
---|---|---|---|---|---|
ΔrH° | 65.7 | kJ/mol | PHPMS | Meot-Ner (Mautner), Sieck, et al., 1994 | gas phase |
Quantity | Value | Units | Method | Reference | Comment |
ΔrS° | 120. | J/mol*K | PHPMS | Meot-Ner (Mautner), Sieck, et al., 1994 | gas phase |
(C4H11O2+ • 2) +
= (C4H11O2+ • 3
)
By formula: (C4H11O2+ • 2H2O) + H2O = (C4H11O2+ • 3H2O)
Bond type: Hydrogen bond (positive ion to hydride)
Quantity | Value | Units | Method | Reference | Comment |
---|---|---|---|---|---|
ΔrH° | 47.3 | kJ/mol | PHPMS | Meot-Ner (Mautner), Sieck, et al., 1994 | gas phase |
Quantity | Value | Units | Method | Reference | Comment |
ΔrS° | 94.1 | J/mol*K | PHPMS | Meot-Ner (Mautner), Sieck, et al., 1994 | gas phase |
(C4H11O2+ • 3) +
= (C4H11O2+ • 4
)
By formula: (C4H11O2+ • 3H2O) + H2O = (C4H11O2+ • 4H2O)
Bond type: Hydrogen bond (positive ion to hydride)
Quantity | Value | Units | Method | Reference | Comment |
---|---|---|---|---|---|
ΔrH° | 45.2 | kJ/mol | PHPMS | Meot-Ner (Mautner), Sieck, et al., 1994 | gas phase |
Quantity | Value | Units | Method | Reference | Comment |
ΔrS° | 100. | J/mol*K | PHPMS | Meot-Ner (Mautner), Sieck, et al., 1994 | gas phase |
(C4H11O2+ • 4) +
= (C4H11O2+ • 5
)
By formula: (C4H11O2+ • 4H2O) + H2O = (C4H11O2+ • 5H2O)
Bond type: Hydrogen bond (positive ion to hydride)
Quantity | Value | Units | Method | Reference | Comment |
---|---|---|---|---|---|
ΔrH° | 42.7 | kJ/mol | PHPMS | Meot-Ner (Mautner), Sieck, et al., 1994 | gas phase |
Quantity | Value | Units | Method | Reference | Comment |
ΔrS° | 105. | J/mol*K | PHPMS | Meot-Ner (Mautner), Sieck, et al., 1994 | gas phase |

References

Meot-Ner (Mautner), Sieck, et al., 1994
Meot-Ner (Mautner), M.; Sieck, L.W.; Liebman, J.F.; Scheiner, S.; Duan, X.,
The Ionic Hydrogen Bond. 5. Polydentate and Solvent-Bridged Structures. Complexing of the Proton and the Hydronium Ions by Polyethers,
J. Am. Chem. Soc., 1994, 116, 17, 7848, https://doi.org/10.1021/ja00096a047
. [all data]