Pyrrolidine, protonated
- Formula: C4H10N+
- Molecular weight: 72.1284

Ion clustering data

Data compiled by: Michael M. Meot-Ner (Mautner) and Sharon G. Lias
Clustering reactions
By formula: C4H10N+ + C4H9N = (C4H10N+ • C4H9N)
Quantity | Value | Units | Method | Reference | Comment |
---|---|---|---|---|---|
ΔrH° | 22.3 | kcal/mol | PHPMS | Hiraoka, Takimoto, et al., 1987 | gas phase |
Quantity | Value | Units | Method | Reference | Comment |
ΔrS° | 23.8 | cal/mol*K | PHPMS | Hiraoka, Takimoto, et al., 1987 | gas phase |
(C4H10N+ • ) +
= (C4H10N+ • 2
)
By formula: (C4H10N+ • C4H9N) + C4H9N = (C4H10N+ • 2C4H9N)
Quantity | Value | Units | Method | Reference | Comment |
---|---|---|---|---|---|
ΔrH° | 15.3 | kcal/mol | PHPMS | Hiraoka, Takimoto, et al., 1987 | gas phase |
Quantity | Value | Units | Method | Reference | Comment |
ΔrS° | 24.3 | cal/mol*K | PHPMS | Hiraoka, Takimoto, et al., 1987 | gas phase |
By formula: C4H10N+ + H2O = (C4H10N+ • H2O)
Bond type: Hydrogen bond (positive ion to hydride)
Quantity | Value | Units | Method | Reference | Comment |
---|---|---|---|---|---|
ΔrH° | 13.7 | kcal/mol | PHPMS | Hiraoka, Takimoto, et al., 1987 | gas phase |
Quantity | Value | Units | Method | Reference | Comment |
ΔrS° | 21.1 | cal/mol*K | PHPMS | Hiraoka, Takimoto, et al., 1987 | gas phase |
(C4H10N+ • ) +
= (C4H10N+ • 2
)
By formula: (C4H10N+ • H2O) + H2O = (C4H10N+ • 2H2O)
Bond type: Hydrogen bond (positive ion to hydride)
Quantity | Value | Units | Method | Reference | Comment |
---|---|---|---|---|---|
ΔrH° | 13.0 | kcal/mol | PHPMS | Hiraoka, Takimoto, et al., 1987 | gas phase |
Quantity | Value | Units | Method | Reference | Comment |
ΔrS° | 25.9 | cal/mol*K | PHPMS | Hiraoka, Takimoto, et al., 1987 | gas phase |

Reaction thermochemistry data

Data compiled by: Michael M. Meot-Ner (Mautner) and Sharon G. Lias

Individual Reactions

(C4H10N+ • Water) + Water = (C4H10N+ • 2Water)

By formula: (C4H10N+ • H2O) + H2O = (C4H10N+ • 2H2O)

Bond type: Hydrogen bond (positive ion to hydride)

Quantity Value Units Method Reference Comment
Δr13.0kcal/molPHPMSHiraoka, Takimoto, et al., 1987gas phase
Quantity Value Units Method Reference Comment
Δr25.9cal/mol*KPHPMSHiraoka, Takimoto, et al., 1987gas phase

C4H10N+ + Water = (C4H10N+ • Water)

By formula: C4H10N+ + H2O = (C4H10N+ • H2O)

Bond type: Hydrogen bond (positive ion to hydride)

Quantity Value Units Method Reference Comment
Δr13.7kcal/molPHPMSHiraoka, Takimoto, et al., 1987gas phase
Quantity Value Units Method Reference Comment
Δr21.1cal/mol*KPHPMSHiraoka, Takimoto, et al., 1987gas phase

(C4H10N+ • Pyrrolidine) + Pyrrolidine = (C4H10N+ • 2Pyrrolidine)

By formula: (C4H10N+ • C4H9N) + C4H9N = (C4H10N+ • 2C4H9N)

Quantity Value Units Method Reference Comment
Δr15.3kcal/molPHPMSHiraoka, Takimoto, et al., 1987gas phase
Quantity Value Units Method Reference Comment
Δr24.3cal/mol*KPHPMSHiraoka, Takimoto, et al., 1987gas phase

C4H10N+ + Pyrrolidine = (C4H10N+ • Pyrrolidine)

By formula: C4H10N+ + C4H9N = (C4H10N+ • C4H9N)

Quantity Value Units Method Reference Comment
Δr22.3kcal/molPHPMSHiraoka, Takimoto, et al., 1987gas phase
Quantity Value Units Method Reference Comment
Δr23.8cal/mol*KPHPMSHiraoka, Takimoto, et al., 1987gas phase

References

Hiraoka, Takimoto, et al., 1987
Hiraoka, K.; Takimoto, H.; Yamabe, S.,
Stabilities and Structures in Cluster Ions of Five-Membered Heterocyclic Compounds Containing O, N and S Atoms,
J. Am. Chem. Soc., 1987, 109, 24, 7346, https://doi.org/10.1021/ja00258a018
. [all data]