Trimethyl tin, positive ion

Ion clustering data

Data compiled by: Michael M. Meot-Ner (Mautner) and Sharon G. Lias

Clustering reactions

C3H9Sn+ + Methyl Alcohol = (C3H9Sn+ • Methyl Alcohol)

By formula: C3H9Sn+ + CH4O = (C3H9Sn+ • CH4O)

Quantity Value Units Method Reference Comment
Δr136.kJ/molPHPMSStone and Splinter, 1984gas phase
Quantity Value Units Method Reference Comment
Δr130.J/mol*KPHPMSStone and Splinter, 1984gas phase

C3H9Sn+ + Methylamine = (C3H9Sn+ • Methylamine)

By formula: C3H9Sn+ + CH5N = (C3H9Sn+ • CH5N)

Quantity Value Units Method Reference Comment
Δr176.kJ/molPHPMSStone and Splinter, 1984gas phase; switching reaction((CH3)3Sn+)CH3OH, Entropy change calculated or estimated
Quantity Value Units Method Reference Comment
Δr128.J/mol*KN/AStone and Splinter, 1984gas phase; switching reaction((CH3)3Sn+)CH3OH, Entropy change calculated or estimated

Free energy of reaction

ΔrG° (kJ/mol) T (K) Method Reference Comment
109.525.PHPMSStone and Splinter, 1984gas phase; switching reaction((CH3)3Sn+)CH3OH, Entropy change calculated or estimated

C3H9Sn+ + Acetonitrile = (C3H9Sn+ • Acetonitrile)

By formula: C3H9Sn+ + C2H3N = (C3H9Sn+ • C2H3N)

Quantity Value Units Method Reference Comment
Δr157.kJ/molPHPMSStone and Splinter, 1984gas phase; switching reaction((CH3)3Sn+)CH3OH, Entropy change calculated or estimated
Quantity Value Units Method Reference Comment
Δr131.J/mol*KN/AStone and Splinter, 1984gas phase; switching reaction((CH3)3Sn+)CH3OH, Entropy change calculated or estimated

Free energy of reaction

ΔrG° (kJ/mol) T (K) Method Reference Comment
87.9525.PHPMSStone and Splinter, 1984gas phase; switching reaction((CH3)3Sn+)CH3OH, Entropy change calculated or estimated

C3H9Sn+ + Ethanol = (C3H9Sn+ • Ethanol)

By formula: C3H9Sn+ + C2H6O = (C3H9Sn+ • C2H6O)

Quantity Value Units Method Reference Comment
Δr146.kJ/molPHPMSStone and Splinter, 1984gas phase; switching reaction((CH3)3Sn+)CH3OH, Entropy change calculated or estimated
Quantity Value Units Method Reference Comment
Δr135.J/mol*KN/AStone and Splinter, 1984gas phase; switching reaction((CH3)3Sn+)CH3OH, Entropy change calculated or estimated

Free energy of reaction

ΔrG° (kJ/mol) T (K) Method Reference Comment
74.9525.PHPMSStone and Splinter, 1984gas phase; switching reaction((CH3)3Sn+)CH3OH, Entropy change calculated or estimated

C3H9Sn+ + Dimethylamine = (C3H9Sn+ • Dimethylamine)

By formula: C3H9Sn+ + C2H7N = (C3H9Sn+ • C2H7N)

Quantity Value Units Method Reference Comment
Δr185.kJ/molPHPMSStone and Splinter, 1984gas phase; switching reaction((CH3)3Sn+)CH3OH, Entropy change calculated or estimated
Δr185.kJ/molPHPMSStone and Splinter, 1984gas phase; switching reaction((CH3)3Sn+)CH3OH, Entropy change calculated or estimated
Quantity Value Units Method Reference Comment
Δr127.J/mol*KN/AStone and Splinter, 1984gas phase; switching reaction((CH3)3Sn+)CH3OH, Entropy change calculated or estimated
Δr133.J/mol*KN/AStone and Splinter, 1984gas phase; switching reaction((CH3)3Sn+)CH3OH, Entropy change calculated or estimated

Free energy of reaction

ΔrG° (kJ/mol) T (K) Method Reference Comment
118.525.PHPMSStone and Splinter, 1984gas phase; switching reaction((CH3)3Sn+)CH3OH, Entropy change calculated or estimated
115.525.PHPMSStone and Splinter, 1984gas phase; switching reaction((CH3)3Sn+)CH3OH, Entropy change calculated or estimated

C3H9Sn+ + Acetone = (C3H9Sn+ • Acetone)

By formula: C3H9Sn+ + C3H6O = (C3H9Sn+ • C3H6O)

Quantity Value Units Method Reference Comment
Δr156.kJ/molPHPMSStone and Splinter, 1984gas phase; switching reaction((CH3)3Sn+)CH3OH, Entropy change calculated or estimated
Quantity Value Units Method Reference Comment
Δr129.J/mol*KN/AStone and Splinter, 1984gas phase; switching reaction((CH3)3Sn+)CH3OH, Entropy change calculated or estimated
Quantity Value Units Method Reference Comment
Δr88.7kJ/molPHPMSStone and Splinter, 1984gas phase; switching reaction((CH3)3Sn+)CH3OH, Entropy change calculated or estimated

C3H9Sn+ + Acetic acid, methyl ester = (C3H9Sn+ • Acetic acid, methyl ester)

By formula: C3H9Sn+ + C3H6O2 = (C3H9Sn+ • C3H6O2)

Quantity Value Units Method Reference Comment
Δr161.kJ/molPHPMSStone and Splinter, 1984gas phase; switching reaction((CH3)3Sn+)CH3OH, Entropy change calculated or estimated
Quantity Value Units Method Reference Comment
Δr136.J/mol*KN/AStone and Splinter, 1984gas phase; switching reaction((CH3)3Sn+)CH3OH, Entropy change calculated or estimated

Free energy of reaction

ΔrG° (kJ/mol) T (K) Method Reference Comment
89.1525.PHPMSStone and Splinter, 1984gas phase; switching reaction((CH3)3Sn+)CH3OH, Entropy change calculated or estimated

C3H9Sn+ + 1-Propanol = (C3H9Sn+ • 1-Propanol)

By formula: C3H9Sn+ + C3H8O = (C3H9Sn+ • C3H8O)

Quantity Value Units Method Reference Comment
Δr149.kJ/molPHPMSStone and Splinter, 1984gas phase; switching reaction((CH3)3Sn+)CH3OH, Entropy change calculated or estimated
Quantity Value Units Method Reference Comment
Δr130.J/mol*KN/AStone and Splinter, 1984gas phase; switching reaction((CH3)3Sn+)CH3OH, Entropy change calculated or estimated

Free energy of reaction

ΔrG° (kJ/mol) T (K) Method Reference Comment
78.2525.PHPMSStone and Splinter, 1984gas phase; switching reaction((CH3)3Sn+)CH3OH, Entropy change calculated or estimated

C3H9Sn+ + Propyl mercaptan = (C3H9Sn+ • Propyl mercaptan)

By formula: C3H9Sn+ + C3H8S = (C3H9Sn+ • C3H8S)

Quantity Value Units Method Reference Comment
Δr143.kJ/molPHPMSStone and Splinter, 1984gas phase; switching reaction((CH3)3Sn+)CH3OH, Entropy change calculated or estimated
Quantity Value Units Method Reference Comment
Δr135.J/mol*KN/AStone and Splinter, 1984gas phase; switching reaction((CH3)3Sn+)CH3OH, Entropy change calculated or estimated

Free energy of reaction

ΔrG° (kJ/mol) T (K) Method Reference Comment
72.4525.PHPMSStone and Splinter, 1984gas phase; switching reaction((CH3)3Sn+)CH3OH, Entropy change calculated or estimated

C3H9Sn+ + Methylamine, N,N-dimethyl- = (C3H9Sn+ • Methylamine, N,N-dimethyl-)

By formula: C3H9Sn+ + C3H9N = (C3H9Sn+ • C3H9N)

Quantity Value Units Method Reference Comment
Δr191.kJ/molPHPMSStone and Splinter, 1984gas phase; switching reaction((CH3)3Sn+)CH3OH, Entropy change calculated or estimated
Quantity Value Units Method Reference Comment
Δr130.J/mol*KN/AStone and Splinter, 1984gas phase; switching reaction((CH3)3Sn+)CH3OH, Entropy change calculated or estimated

Free energy of reaction

ΔrG° (kJ/mol) T (K) Method Reference Comment
120.525.PHPMSStone and Splinter, 1984gas phase; switching reaction((CH3)3Sn+)CH3OH, Entropy change calculated or estimated

C3H9Sn+ + 2-Butanone = (C3H9Sn+ • 2-Butanone)

By formula: C3H9Sn+ + C4H8O = (C3H9Sn+ • C4H8O)

Quantity Value Units Method Reference Comment
Δr164.kJ/molPHPMSStone and Splinter, 1984gas phase; switching reaction((CH3)3Sn+)CH3OH, Entropy change calculated or estimated
Quantity Value Units Method Reference Comment
Δr137.J/mol*KN/AStone and Splinter, 1984gas phase; switching reaction((CH3)3Sn+)CH3OH, Entropy change calculated or estimated

Free energy of reaction

ΔrG° (kJ/mol) T (K) Method Reference Comment
92.5525.PHPMSStone and Splinter, 1984gas phase; switching reaction((CH3)3Sn+)CH3OH, Entropy change calculated or estimated

C3H9Sn+ + Ethyl Acetate = (C3H9Sn+ • Ethyl Acetate)

By formula: C3H9Sn+ + C4H8O2 = (C3H9Sn+ • C4H8O2)

Quantity Value Units Method Reference Comment
Δr168.kJ/molPHPMSStone and Splinter, 1984gas phase; switching reaction((CH3)3Sn+)CH3OH, Entropy change calculated or estimated
Quantity Value Units Method Reference Comment
Δr140.J/mol*KN/AStone and Splinter, 1984gas phase; switching reaction((CH3)3Sn+)CH3OH, Entropy change calculated or estimated

Free energy of reaction

ΔrG° (kJ/mol) T (K) Method Reference Comment
95.8525.PHPMSStone and Splinter, 1984gas phase; switching reaction((CH3)3Sn+)CH3OH, Entropy change calculated or estimated

C3H9Sn+ + 1-Butanol = (C3H9Sn+ • 1-Butanol)

By formula: C3H9Sn+ + C4H10O = (C3H9Sn+ • C4H10O)

Quantity Value Units Method Reference Comment
Δr153.kJ/molPHPMSStone and Splinter, 1984gas phase; switching reaction((CH3)3Sn+)CH3OH, Entropy change calculated or estimated
Quantity Value Units Method Reference Comment
Δr136.J/mol*KN/AStone and Splinter, 1984gas phase; switching reaction((CH3)3Sn+)CH3OH, Entropy change calculated or estimated

Free energy of reaction

ΔrG° (kJ/mol) T (K) Method Reference Comment
81.6525.PHPMSStone and Splinter, 1984gas phase; switching reaction((CH3)3Sn+)CH3OH, Entropy change calculated or estimated

C3H9Sn+ + 2-Propanol, 2-methyl- = (C3H9Sn+ • 2-Propanol, 2-methyl-)

By formula: C3H9Sn+ + C4H10O = (C3H9Sn+ • C4H10O)

Quantity Value Units Method Reference Comment
Δr153.kJ/molPHPMSStone and Splinter, 1984gas phase; switching reaction((CH3)3Sn+)CH3OH, Entropy change calculated or estimated
Quantity Value Units Method Reference Comment
Δr136.J/mol*KN/AStone and Splinter, 1984gas phase; switching reaction((CH3)3Sn+)CH3OH, Entropy change calculated or estimated

Free energy of reaction

ΔrG° (kJ/mol) T (K) Method Reference Comment
82.0525.PHPMSStone and Splinter, 1984gas phase; switching reaction((CH3)3Sn+)CH3OH, Entropy change calculated or estimated

C3H9Sn+ + Ethanamine, N-ethyl- = (C3H9Sn+ • Ethanamine, N-ethyl-)

By formula: C3H9Sn+ + C4H11N = (C3H9Sn+ • C4H11N)

Quantity Value Units Method Reference Comment
Δr194.kJ/molPHPMSStone and Splinter, 1984gas phase; switching reaction((CH3)3Sn+)CH3OH, Entropy change calculated or estimated
Quantity Value Units Method Reference Comment
Δr140.J/mol*KN/AStone and Splinter, 1984gas phase; switching reaction((CH3)3Sn+)CH3OH, Entropy change calculated or estimated

Free energy of reaction

ΔrG° (kJ/mol) T (K) Method Reference Comment
122.525.PHPMSStone and Splinter, 1984gas phase; switching reaction((CH3)3Sn+)CH3OH, Entropy change calculated or estimated

C3H9Sn+ + 3-Pentanone = (C3H9Sn+ • 3-Pentanone)

By formula: C3H9Sn+ + C5H10O = (C3H9Sn+ • C5H10O)

Quantity Value Units Method Reference Comment
Δr165.kJ/molPHPMSStone and Splinter, 1984gas phase; switching reaction((CH3)3Sn+)CH3OH, Entropy change calculated or estimated
Quantity Value Units Method Reference Comment
Δr132.J/mol*KN/AStone and Splinter, 1984gas phase; switching reaction((CH3)3Sn+)CH3OH, Entropy change calculated or estimated

Free energy of reaction

ΔrG° (kJ/mol) T (K) Method Reference Comment
95.8525.PHPMSStone and Splinter, 1984gas phase; switching reaction((CH3)3Sn+)CH3OH, Entropy change calculated or estimated

C3H9Sn+ + Isopropyl acetate = (C3H9Sn+ • Isopropyl acetate)

By formula: C3H9Sn+ + C5H10O2 = (C3H9Sn+ • C5H10O2)

Quantity Value Units Method Reference Comment
Δr175.kJ/molPHPMSStone and Splinter, 1984gas phase; switching reaction((CH3)3Sn+)CH3OH, Entropy change calculated or estimated
Quantity Value Units Method Reference Comment
Δr140.J/mol*KN/AStone and Splinter, 1984gas phase; switching reaction((CH3)3Sn+)CH3OH, Entropy change calculated or estimated

Free energy of reaction

ΔrG° (kJ/mol) T (K) Method Reference Comment
101.525.PHPMSStone and Splinter, 1984gas phase; switching reaction((CH3)3Sn+)CH3OH, Entropy change calculated or estimated

C3H9Sn+ + n-Propyl acetate = (C3H9Sn+ • n-Propyl acetate)

By formula: C3H9Sn+ + C5H10O2 = (C3H9Sn+ • C5H10O2)

Quantity Value Units Method Reference Comment
Δr168.kJ/molPHPMSStone and Splinter, 1984gas phase; switching reaction((CH3)3Sn+)CH3OH, Entropy change calculated or estimated
Quantity Value Units Method Reference Comment
Δr137.J/mol*KN/AStone and Splinter, 1984gas phase; switching reaction((CH3)3Sn+)CH3OH, Entropy change calculated or estimated

Free energy of reaction

ΔrG° (kJ/mol) T (K) Method Reference Comment
96.2525.PHPMSStone and Splinter, 1984gas phase; switching reaction((CH3)3Sn+)CH3OH, Entropy change calculated or estimated

C3H9Sn+ + Acetic acid, butyl ester = (C3H9Sn+ • Acetic acid, butyl ester)

By formula: C3H9Sn+ + C6H12O2 = (C3H9Sn+ • C6H12O2)

Quantity Value Units Method Reference Comment
Δr174.kJ/molPHPMSStone and Splinter, 1984gas phase; switching reaction((CH3)3Sn+)CH3OH, Entropy change calculated or estimated
Quantity Value Units Method Reference Comment
Δr140.J/mol*KN/AStone and Splinter, 1984gas phase; switching reaction((CH3)3Sn+)CH3OH, Entropy change calculated or estimated

Free energy of reaction

ΔrG° (kJ/mol) T (K) Method Reference Comment
101.525.PHPMSStone and Splinter, 1984gas phase; switching reaction((CH3)3Sn+)CH3OH, Entropy change calculated or estimated

C3H9Sn+ + 1-Hexanol = (C3H9Sn+ • 1-Hexanol)

By formula: C3H9Sn+ + C6H14O = (C3H9Sn+ • C6H14O)

Quantity Value Units Method Reference Comment
Δr157.kJ/molPHPMSStone and Splinter, 1984gas phase; switching reaction((CH3)3Sn+)CH3OH, Entropy change calculated or estimated
Quantity Value Units Method Reference Comment
Δr139.J/mol*KN/AStone and Splinter, 1984gas phase; switching reaction((CH3)3Sn+)CH3OH, Entropy change calculated or estimated

Free energy of reaction

ΔrG° (kJ/mol) T (K) Method Reference Comment
83.7525.PHPMSStone and Splinter, 1984gas phase; switching reaction((CH3)3Sn+)CH3OH, Entropy change calculated or estimated

C3H9Sn+ + Triethylamine = (C3H9Sn+ • Triethylamine)

By formula: C3H9Sn+ + C6H15N = (C3H9Sn+ • C6H15N)

Quantity Value Units Method Reference Comment
Δr191.kJ/molPHPMSStone and Splinter, 1984gas phase; switching reaction((CH3)3Sn+)CH3OH, Entropy change calculated or estimated
Quantity Value Units Method Reference Comment
Δr142.J/mol*KN/AStone and Splinter, 1984gas phase; switching reaction((CH3)3Sn+)CH3OH, Entropy change calculated or estimated

Free energy of reaction

ΔrG° (kJ/mol) T (K) Method Reference Comment
117.525.PHPMSStone and Splinter, 1984gas phase; switching reaction((CH3)3Sn+)CH3OH, Entropy change calculated or estimated

C3H9Sn+ + o-Xylene = (C3H9Sn+ • o-Xylene)

By formula: C3H9Sn+ + C8H10 = (C3H9Sn+ • C8H10)

Quantity Value Units Method Reference Comment
Δr125.kJ/molPHPMSStone and Splinter, 1984gas phase; switching reaction((CH3)3Sn+)CH3OH, Entropy change calculated or estimated
Quantity Value Units Method Reference Comment
Δr133.J/mol*KN/AStone and Splinter, 1984gas phase; switching reaction((CH3)3Sn+)CH3OH, Entropy change calculated or estimated

Free energy of reaction

ΔrG° (kJ/mol) T (K) Method Reference Comment
55.2525.PHPMSStone and Splinter, 1984gas phase; switching reaction((CH3)3Sn+)CH3OH, Entropy change calculated or estimated

C3H9Sn+ + 1-Butanamine, N-butyl- = (C3H9Sn+ • 1-Butanamine, N-butyl-)

By formula: C3H9Sn+ + C8H19N = (C3H9Sn+ • C8H19N)

Quantity Value Units Method Reference Comment
Δr204.kJ/molPHPMSStone and Splinter, 1984gas phase; switching reaction((CH3)3Sn+)CH3OH, Entropy change calculated or estimated
Quantity Value Units Method Reference Comment
Δr141.J/mol*KN/AStone and Splinter, 1984gas phase; switching reaction((CH3)3Sn+)CH3OH, Entropy change calculated or estimated

Free energy of reaction

ΔrG° (kJ/mol) T (K) Method Reference Comment
130.525.PHPMSStone and Splinter, 1984gas phase; switching reaction((CH3)3Sn+)CH3OH, Entropy change calculated or estimated

C3H9Sn+ + Mesitylene = (C3H9Sn+ • Mesitylene)

By formula: C3H9Sn+ + C9H12 = (C3H9Sn+ • C9H12)

Quantity Value Units Method Reference Comment
Δr134.kJ/molPHPMSStone and Splinter, 1984gas phase; switching reaction((CH3)3Sn+)CH3OH, Entropy change calculated or estimated
Quantity Value Units Method Reference Comment
Δr133.J/mol*KN/AStone and Splinter, 1984gas phase; switching reaction((CH3)3Sn+)CH3OH, Entropy change calculated or estimated

Free energy of reaction

ΔrG° (kJ/mol) T (K) Method Reference Comment
64.0525.PHPMSStone and Splinter, 1984gas phase; switching reaction((CH3)3Sn+)CH3OH, Entropy change calculated or estimated

C3H9Sn+ + Tributylamine = (C3H9Sn+ • Tributylamine)

By formula: C3H9Sn+ + C12H27N = (C3H9Sn+ • C12H27N)

Quantity Value Units Method Reference Comment
Δr201.kJ/molPHPMSStone and Splinter, 1984gas phase; switching reaction((CH3)3Sn+)CH3OH, Entropy change calculated or estimated
Quantity Value Units Method Reference Comment
Δr144.J/mol*KN/AStone and Splinter, 1984gas phase; switching reaction((CH3)3Sn+)CH3OH, Entropy change calculated or estimated

Free energy of reaction

ΔrG° (kJ/mol) T (K) Method Reference Comment
126.525.PHPMSStone and Splinter, 1984gas phase; switching reaction((CH3)3Sn+)CH3OH, Entropy change calculated or estimated

C3H9Sn+ + Water = (C3H9Sn+ • Water)

By formula: C3H9Sn+ + H2O = (C3H9Sn+ • H2O)

Quantity Value Units Method Reference Comment
Δr108.kJ/molPHPMSStone and Splinter, 1984gas phase; switching reaction((CH3)3Sn+)CH3OH; Entropy change calculated or estimated
Quantity Value Units Method Reference Comment
Δr115.J/mol*KN/AStone and Splinter, 1984gas phase; switching reaction((CH3)3Sn+)CH3OH; Entropy change calculated or estimated

Free energy of reaction

ΔrG° (kJ/mol) T (K) Method Reference Comment
46.9525.PHPMSStone and Splinter, 1984gas phase; switching reaction((CH3)3Sn+)CH3OH; Entropy change calculated or estimated

C3H9Sn+ + Ammonia = (C3H9Sn+ • Ammonia)

By formula: C3H9Sn+ + H3N = (C3H9Sn+ • H3N)

Quantity Value Units Method Reference Comment
Δr154.kJ/molPHPMSStone and Splinter, 1984gas phase; switching reaction((CH3)3Sn+)CH3OH/NH3, Entropy change calculated or estimated
Quantity Value Units Method Reference Comment
Δr122.J/mol*KN/AStone and Splinter, 1984gas phase; switching reaction((CH3)3Sn+)CH3OH/NH3, Entropy change calculated or estimated

Free energy of reaction

ΔrG° (kJ/mol) T (K) Method Reference Comment
90.4525.PHPMSStone and Splinter, 1984gas phase; switching reaction((CH3)3Sn+)CH3OH/NH3, Entropy change calculated or estimated

References

Stone and Splinter, 1984
Stone, J.A.; Splinter, D.E., A high-pressure mass spectrometric study of the binding of (CH3)3Sn+ to lewis bases in the gas phase, Int. J. Mass Spectrom. Ion Processes, 1984, 59, 169. [all data]