Glycerol, protonated
- Formula: C3H9O3+
- Molecular weight: 93.1012

Ion clustering data

Data compiled by: Michael M. Meot-Ner (Mautner) and Sharon G. Lias
Clustering reactions
By formula: C3H9O3+ + C3H8O3 = (C3H9O3+ • C3H8O3)
Bond type: Hydrogen bonds of the type OH-O between organics
Free energy of reaction
ΔrG° (kcal/mol) | T (K) | Method | Reference | Comment |
---|---|---|---|---|
13.7 | 500. | PHPMS | Sunner, Kulatunga, et al., 1986 | gas phase |

Reaction thermochemistry data

Data compiled by: Michael M. Meot-Ner (Mautner) and Sharon G. Lias

Individual Reactions

C3H9O3+ + Glycerin = (C3H9O3+ • Glycerin)

By formula: C3H9O3+ + C3H8O3 = (C3H9O3+ • C3H8O3)

Bond type: Hydrogen bonds of the type OH-O between organics

Free energy of reaction

ΔrG° (kcal/mol) T (K) Method Reference Comment
13.7500.PHPMSSunner, Kulatunga, et al., 1986gas phase

References

Sunner, Kulatunga, et al., 1986
Sunner, J.A.; Kulatunga, R.; Kebarle, P.,
Fast Atom Bombardment Mass Spectrometry and Gas Phase Basicities,
Anal. Chem., 1986, 58, 7, 1312, https://doi.org/10.1021/ac00298a010
. [all data]