Imidazole, protonated
- Formula: C3H4N2+
- Molecular weight: 68.0767

Reaction thermochemistry data

Data compiled by: Michael M. Meot-Ner (Mautner) and Sharon G. Lias
Individual Reactions
(C3H4N2+ • 2) +
= (C3H4N2+ • 3
)
By formula: (C3H4N2+ • 2H2O) + H2O = (C3H4N2+ • 3H2O)
Bond type: Hydrogen bond (positive ion to hydride)
Quantity | Value | Units | Method | Reference | Comment |
---|---|---|---|---|---|
ΔrH° | 51.0 | kJ/mol | PHPMS | Meot-Ner (Mautner), 1988 | gas phase |
Quantity | Value | Units | Method | Reference | Comment |
ΔrS° | 125. | J/mol*K | PHPMS | Meot-Ner (Mautner), 1988 | gas phase |
(C3H4N2+ • ) +
= (C3H4N2+ • 2
)
By formula: (C3H4N2+ • H2O) + H2O = (C3H4N2+ • 2H2O)
Bond type: Hydrogen bond (positive ion to hydride)
Quantity | Value | Units | Method | Reference | Comment |
---|---|---|---|---|---|
ΔrH° | 52.7 | kJ/mol | PHPMS | Meot-Ner (Mautner), 1988 | gas phase |
Quantity | Value | Units | Method | Reference | Comment |
ΔrS° | 97.5 | J/mol*K | PHPMS | Meot-Ner (Mautner), 1988 | gas phase |
By formula: C3H4N2+ + H2O = (C3H4N2+ • H2O)
Bond type: Hydrogen bond (positive ion to hydride)
Quantity | Value | Units | Method | Reference | Comment |
---|---|---|---|---|---|
ΔrH° | 61.9 | kJ/mol | PHPMS | Meot-Ner (Mautner), 1988 | gas phase |
Quantity | Value | Units | Method | Reference | Comment |
ΔrS° | 99.6 | J/mol*K | PHPMS | Meot-Ner (Mautner), 1988 | gas phase |
(C3H4N2+ • ) +
= (C3H4N2+ • 2
)
By formula: (C3H4N2+ • C6H11NO3) + C6H11NO3 = (C3H4N2+ • 2C6H11NO3)
Quantity | Value | Units | Method | Reference | Comment |
---|---|---|---|---|---|
ΔrH° | 91.2 | kJ/mol | PHPMS | Meot-Ner (Mautner), 1988 | gas phase |
Quantity | Value | Units | Method | Reference | Comment |
ΔrS° | 131. | J/mol*K | PHPMS | Meot-Ner (Mautner), 1988 | gas phase |
By formula: C3H4N2+ + C6H11NO3 = (C3H4N2+ • C6H11NO3)
Quantity | Value | Units | Method | Reference | Comment |
---|---|---|---|---|---|
ΔrH° | 116. | kJ/mol | PHPMS | Meot-Ner (Mautner), 1988 | gas phase |
Quantity | Value | Units | Method | Reference | Comment |
ΔrS° | 113. | J/mol*K | PHPMS | Meot-Ner (Mautner), 1988 | gas phase |
By formula: C3H4N2+ + C3H4N2 = (C3H4N2+ • C3H4N2)
Quantity | Value | Units | Method | Reference | Comment |
---|---|---|---|---|---|
ΔrH° | 99.2 | kJ/mol | PHPMS | Meot-Ner (Mautner), 1988 | gas phase |
Quantity | Value | Units | Method | Reference | Comment |
ΔrS° | 90.8 | J/mol*K | PHPMS | Meot-Ner (Mautner), 1988 | gas phase |

Ion clustering data

Data compiled by: Michael M. Meot-Ner (Mautner) and Sharon G. Lias
Clustering reactions
By formula: C3H4N2+ + C3H4N2 = (C3H4N2+ • C3H4N2)
Quantity | Value | Units | Method | Reference | Comment |
---|---|---|---|---|---|
ΔrH° | 99.2 | kJ/mol | PHPMS | Meot-Ner (Mautner), 1988 | gas phase |
Quantity | Value | Units | Method | Reference | Comment |
ΔrS° | 90.8 | J/mol*K | PHPMS | Meot-Ner (Mautner), 1988 | gas phase |
By formula: C3H4N2+ + C6H11NO3 = (C3H4N2+ • C6H11NO3)
Quantity | Value | Units | Method | Reference | Comment |
---|---|---|---|---|---|
ΔrH° | 116. | kJ/mol | PHPMS | Meot-Ner (Mautner), 1988 | gas phase |
Quantity | Value | Units | Method | Reference | Comment |
ΔrS° | 113. | J/mol*K | PHPMS | Meot-Ner (Mautner), 1988 | gas phase |
(C3H4N2+ • ) +
= (C3H4N2+ • 2
)
By formula: (C3H4N2+ • C6H11NO3) + C6H11NO3 = (C3H4N2+ • 2C6H11NO3)
Quantity | Value | Units | Method | Reference | Comment |
---|---|---|---|---|---|
ΔrH° | 91.2 | kJ/mol | PHPMS | Meot-Ner (Mautner), 1988 | gas phase |
Quantity | Value | Units | Method | Reference | Comment |
ΔrS° | 131. | J/mol*K | PHPMS | Meot-Ner (Mautner), 1988 | gas phase |
By formula: C3H4N2+ + H2O = (C3H4N2+ • H2O)
Bond type: Hydrogen bond (positive ion to hydride)
Quantity | Value | Units | Method | Reference | Comment |
---|---|---|---|---|---|
ΔrH° | 61.9 | kJ/mol | PHPMS | Meot-Ner (Mautner), 1988 | gas phase |
Quantity | Value | Units | Method | Reference | Comment |
ΔrS° | 99.6 | J/mol*K | PHPMS | Meot-Ner (Mautner), 1988 | gas phase |
(C3H4N2+ • ) +
= (C3H4N2+ • 2
)
By formula: (C3H4N2+ • H2O) + H2O = (C3H4N2+ • 2H2O)
Bond type: Hydrogen bond (positive ion to hydride)
Quantity | Value | Units | Method | Reference | Comment |
---|---|---|---|---|---|
ΔrH° | 52.7 | kJ/mol | PHPMS | Meot-Ner (Mautner), 1988 | gas phase |
Quantity | Value | Units | Method | Reference | Comment |
ΔrS° | 97.5 | J/mol*K | PHPMS | Meot-Ner (Mautner), 1988 | gas phase |
(C3H4N2+ • 2) +
= (C3H4N2+ • 3
)
By formula: (C3H4N2+ • 2H2O) + H2O = (C3H4N2+ • 3H2O)
Bond type: Hydrogen bond (positive ion to hydride)
Quantity | Value | Units | Method | Reference | Comment |
---|---|---|---|---|---|
ΔrH° | 51.0 | kJ/mol | PHPMS | Meot-Ner (Mautner), 1988 | gas phase |
Quantity | Value | Units | Method | Reference | Comment |
ΔrS° | 125. | J/mol*K | PHPMS | Meot-Ner (Mautner), 1988 | gas phase |

References

Meot-Ner (Mautner), 1988
Meot-Ner (Mautner), M.,
Models for Strong Interactions in Proteins and Enzymes. 2. Interactions of Ions with the Peptide Link and Imidazole,
J. Am. Chem. Soc., 1988, 110, 10, 3075, https://doi.org/10.1021/ja00218a014
. [all data]