1,2-Diaminopropane, protonated
- Formula: C3H11N2+
- Molecular weight: 75.1323

Reaction thermochemistry data

Data compiled by: Michael M. Meot-Ner (Mautner) and Sharon G. Lias
Individual Reactions
(C3H11N2+ • 2) +
= (C3H11N2+ • 3
)
By formula: (C3H11N2+ • 2C3H10N2) + C3H10N2 = (C3H11N2+ • 3C3H10N2)
Quantity | Value | Units | Method | Reference | Comment |
---|---|---|---|---|---|
ΔrH° | 81.6 | kJ/mol | HPMS | Wincel and Herman, 1973 | gas phase; Entropy change is questionable |
Quantity | Value | Units | Method | Reference | Comment |
ΔrS° | 229. | J/mol*K | HPMS | Wincel and Herman, 1973 | gas phase; Entropy change is questionable |

Ion clustering data

Data compiled by: Michael M. Meot-Ner (Mautner) and Sharon G. Lias
Clustering reactions
(C3H11N2+ • 2) +
= (C3H11N2+ • 3
)
By formula: (C3H11N2+ • 2C3H10N2) + C3H10N2 = (C3H11N2+ • 3C3H10N2)
Quantity | Value | Units | Method | Reference | Comment |
---|---|---|---|---|---|
ΔrH° | 81.6 | kJ/mol | HPMS | Wincel and Herman, 1973 | gas phase; Entropy change is questionable |
Quantity | Value | Units | Method | Reference | Comment |
ΔrS° | 229. | J/mol*K | HPMS | Wincel and Herman, 1973 | gas phase; Entropy change is questionable |

References

Wincel and Herman, 1973
Wincel, H.; Herman, J.A.,
Photoionization Study of Clustering Reactions in Diamines: Ethane-1,2-diamine, Propane-1,2-diamine and Propane-1,3-diamine,
J. Chem. Soc. Faraday Trans., 1973, 69, 1797, https://doi.org/10.1039/f19736901797
. [all data]