2-Propanamine, protonated
- Formula: C3H210N+
- Molecular weight: 261.7057

Reaction thermochemistry data

Data compiled by: Michael M. Meot-Ner (Mautner) and Sharon G. Lias
Individual Reactions
(C3H210N+ • 2) +
= (C3H210N+ • 3
)
By formula: (C3H210N+ • 2C3H9N) + C3H9N = (C3H210N+ • 3C3H9N)
Quantity | Value | Units | Method | Reference | Comment |
---|---|---|---|---|---|
ΔrH° | 67.8 | kJ/mol | HPMS | Zielinska and Wincel, 1974 | gas phase; Entropy change is questionable |
Quantity | Value | Units | Method | Reference | Comment |
ΔrS° | 164. | J/mol*K | HPMS | Zielinska and Wincel, 1974 | gas phase; Entropy change is questionable |
(C3H210N+ • ) +
= (C3H210N+ • 2
)
By formula: (C3H210N+ • C3H9N) + C3H9N = (C3H210N+ • 2C3H9N)
Quantity | Value | Units | Method | Reference | Comment |
---|---|---|---|---|---|
ΔrH° | 82.8 | kJ/mol | HPMS | Zielinska and Wincel, 1974 | gas phase; Entropy change is questionable |
Quantity | Value | Units | Method | Reference | Comment |
ΔrS° | 178. | J/mol*K | HPMS | Zielinska and Wincel, 1974 | gas phase; Entropy change is questionable |

Ion clustering data

Data compiled by: Michael M. Meot-Ner (Mautner) and Sharon G. Lias
Clustering reactions
(C3H210N+ • ) +
= (C3H210N+ • 2
)
By formula: (C3H210N+ • C3H9N) + C3H9N = (C3H210N+ • 2C3H9N)
Quantity | Value | Units | Method | Reference | Comment |
---|---|---|---|---|---|
ΔrH° | 82.8 | kJ/mol | HPMS | Zielinska and Wincel, 1974 | gas phase; Entropy change is questionable |
Quantity | Value | Units | Method | Reference | Comment |
ΔrS° | 178. | J/mol*K | HPMS | Zielinska and Wincel, 1974 | gas phase; Entropy change is questionable |
(C3H210N+ • 2) +
= (C3H210N+ • 3
)
By formula: (C3H210N+ • 2C3H9N) + C3H9N = (C3H210N+ • 3C3H9N)
Quantity | Value | Units | Method | Reference | Comment |
---|---|---|---|---|---|
ΔrH° | 67.8 | kJ/mol | HPMS | Zielinska and Wincel, 1974 | gas phase; Entropy change is questionable |
Quantity | Value | Units | Method | Reference | Comment |
ΔrS° | 164. | J/mol*K | HPMS | Zielinska and Wincel, 1974 | gas phase; Entropy change is questionable |

References

Zielinska and Wincel, 1974
Zielinska, T.J.; Wincel, H.,
Gas - Phase Solvation of Protonated Aliphatic Amines: Methyl, Ethyl, n - Propyl, and Iso - Propylamine,
Chem. Phys. Lett., 1974, 25, 354. [all data]