1-Propanamine, protonated
- Formula: C3H10N+
- Molecular weight: 60.1177

Reaction thermochemistry data

Data compiled by: Michael M. Meot-Ner (Mautner) and Sharon G. Lias
Individual Reactions
By formula: C3H10N+ + H2O = (C3H10N+ • H2O)
Bond type: Hydrogen bond (positive ion to hydride)
Quantity | Value | Units | Method | Reference | Comment |
---|---|---|---|---|---|
ΔrH° | 65.3 | kJ/mol | ES/HPMS | Blades, Klassen, et al., 1996 | gas phase |
ΔrH° | 63.2 | kJ/mol | PHPMS | Meot-Ner (Mautner), 1984 | gas phase |
Quantity | Value | Units | Method | Reference | Comment |
ΔrS° | 95.4 | J/mol*K | ES/HPMS | Blades, Klassen, et al., 1996 | gas phase |
ΔrS° | 90.0 | J/mol*K | PHPMS | Meot-Ner (Mautner), 1984 | gas phase |
Quantity | Value | Units | Method | Reference | Comment |
ΔrG° | 37. | kJ/mol | ES/HPMS | Blades, Klassen, et al., 1996 | gas phase |
(C3H10N+ • 4) +
= (C3H10N+ • 5
)
By formula: (C3H10N+ • 4C3H9N) + C3H9N = (C3H10N+ • 5C3H9N)
Quantity | Value | Units | Method | Reference | Comment |
---|---|---|---|---|---|
ΔrH° | 30. | kJ/mol | PHPMS | Meot-Ner (Mautner), 1992 | gas phase; Entropy change calculated or estimated |
Quantity | Value | Units | Method | Reference | Comment |
ΔrS° | 92. | J/mol*K | N/A | Meot-Ner (Mautner), 1992 | gas phase; Entropy change calculated or estimated |
Free energy of reaction
ΔrG° (kJ/mol) | T (K) | Method | Reference | Comment |
---|---|---|---|---|
14. | 174. | PHPMS | Meot-Ner (Mautner), 1992 | gas phase; Entropy change calculated or estimated |
(C3H10N+ • 2) +
= (C3H10N+ • 3
)
By formula: (C3H10N+ • 2C3H9N) + C3H9N = (C3H10N+ • 3C3H9N)
Quantity | Value | Units | Method | Reference | Comment |
---|---|---|---|---|---|
ΔrH° | 58.6 | kJ/mol | PHPMS | Meot-Ner (Mautner), 1992 | gas phase |
ΔrH° | 71.5 | kJ/mol | HPMS | Zielinska and Wincel, 1974 | gas phase; Entropy change is questionable |
Quantity | Value | Units | Method | Reference | Comment |
ΔrS° | 126. | J/mol*K | PHPMS | Meot-Ner (Mautner), 1992 | gas phase |
ΔrS° | 177. | J/mol*K | HPMS | Zielinska and Wincel, 1974 | gas phase; Entropy change is questionable |
(C3H10N+ • ) +
= (C3H10N+ • 2
)
By formula: (C3H10N+ • C3H9N) + C3H9N = (C3H10N+ • 2C3H9N)
Quantity | Value | Units | Method | Reference | Comment |
---|---|---|---|---|---|
ΔrH° | 66.9 | kJ/mol | PHPMS | Meot-Ner (Mautner), 1992 | gas phase |
ΔrH° | 81.6 | kJ/mol | HPMS | Zielinska and Wincel, 1974 | gas phase; Entropy change is questionable |
Quantity | Value | Units | Method | Reference | Comment |
ΔrS° | 110. | J/mol*K | PHPMS | Meot-Ner (Mautner), 1992 | gas phase |
ΔrS° | 174. | J/mol*K | HPMS | Zielinska and Wincel, 1974 | gas phase; Entropy change is questionable |
(C3H10N+ • 2) +
= (C3H10N+ • 3
)
By formula: (C3H10N+ • 2H2O) + H2O = (C3H10N+ • 3H2O)
Bond type: Hydrogen bond (positive ion to hydride)
Quantity | Value | Units | Method | Reference | Comment |
---|---|---|---|---|---|
ΔrH° | 43.1 | kJ/mol | PHPMS | Meot-Ner (Mautner), 1984 | gas phase |
Quantity | Value | Units | Method | Reference | Comment |
ΔrS° | 96.7 | J/mol*K | PHPMS | Meot-Ner (Mautner), 1984 | gas phase |
Free energy of reaction
ΔrG° (kJ/mol) | T (K) | Method | Reference | Comment |
---|---|---|---|---|
19. | 293. | ES/HPMS | Blades, Klassen, et al., 1995 | gas phase |
(C3H10N+ • ) +
= (C3H10N+ • 2
)
By formula: (C3H10N+ • H2O) + H2O = (C3H10N+ • 2H2O)
Bond type: Hydrogen bond (positive ion to hydride)
Quantity | Value | Units | Method | Reference | Comment |
---|---|---|---|---|---|
ΔrH° | 48.5 | kJ/mol | PHPMS | Meot-Ner (Mautner), 1984 | gas phase |
Quantity | Value | Units | Method | Reference | Comment |
ΔrS° | 89.1 | J/mol*K | PHPMS | Meot-Ner (Mautner), 1984 | gas phase |
Free energy of reaction
ΔrG° (kJ/mol) | T (K) | Method | Reference | Comment |
---|---|---|---|---|
27. | 293. | ES/HPMS | Blades, Klassen, et al., 1995 | gas phase |
(C3H10N+ • 3) +
= (C3H10N+ • 4
)
By formula: (C3H10N+ • 3H2O) + H2O = (C3H10N+ • 4H2O)
Bond type: Hydrogen bond (positive ion to hydride)
Quantity | Value | Units | Method | Reference | Comment |
---|---|---|---|---|---|
ΔrH° | 41. | kJ/mol | PHPMS | Meot-Ner (Mautner), 1984 | gas phase |
Quantity | Value | Units | Method | Reference | Comment |
ΔrS° | 104. | J/mol*K | PHPMS | Meot-Ner (Mautner), 1984 | gas phase |
(C3H10N+ • 3) +
= (C3H10N+ • 4
)
By formula: (C3H10N+ • 3C3H9N) + C3H9N = (C3H10N+ • 4C3H9N)
Quantity | Value | Units | Method | Reference | Comment |
---|---|---|---|---|---|
ΔrH° | 32. | kJ/mol | PHPMS | Meot-Ner (Mautner), 1992 | gas phase |
Quantity | Value | Units | Method | Reference | Comment |
ΔrS° | 84.1 | J/mol*K | PHPMS | Meot-Ner (Mautner), 1992 | gas phase |
By formula: C3H10N+ + C3H9N = (C3H10N+ • C3H9N)
Quantity | Value | Units | Method | Reference | Comment |
---|---|---|---|---|---|
ΔrH° | 103. | kJ/mol | PHPMS | Meot-Ner (Mautner), 1992 | gas phase |
Quantity | Value | Units | Method | Reference | Comment |
ΔrS° | 115. | J/mol*K | PHPMS | Meot-Ner (Mautner), 1992 | gas phase |

Ion clustering data

Data compiled by: Michael M. Meot-Ner (Mautner) and Sharon G. Lias
Clustering reactions
By formula: C3H10N+ + C3H9N = (C3H10N+ • C3H9N)
Quantity | Value | Units | Method | Reference | Comment |
---|---|---|---|---|---|
ΔrH° | 103. | kJ/mol | PHPMS | Meot-Ner (Mautner), 1992 | gas phase |
Quantity | Value | Units | Method | Reference | Comment |
ΔrS° | 115. | J/mol*K | PHPMS | Meot-Ner (Mautner), 1992 | gas phase |
(C3H10N+ • ) +
= (C3H10N+ • 2
)
By formula: (C3H10N+ • C3H9N) + C3H9N = (C3H10N+ • 2C3H9N)
Quantity | Value | Units | Method | Reference | Comment |
---|---|---|---|---|---|
ΔrH° | 66.9 | kJ/mol | PHPMS | Meot-Ner (Mautner), 1992 | gas phase |
ΔrH° | 81.6 | kJ/mol | HPMS | Zielinska and Wincel, 1974 | gas phase; Entropy change is questionable |
Quantity | Value | Units | Method | Reference | Comment |
ΔrS° | 110. | J/mol*K | PHPMS | Meot-Ner (Mautner), 1992 | gas phase |
ΔrS° | 174. | J/mol*K | HPMS | Zielinska and Wincel, 1974 | gas phase; Entropy change is questionable |
(C3H10N+ • 2) +
= (C3H10N+ • 3
)
By formula: (C3H10N+ • 2C3H9N) + C3H9N = (C3H10N+ • 3C3H9N)
Quantity | Value | Units | Method | Reference | Comment |
---|---|---|---|---|---|
ΔrH° | 58.6 | kJ/mol | PHPMS | Meot-Ner (Mautner), 1992 | gas phase |
ΔrH° | 71.5 | kJ/mol | HPMS | Zielinska and Wincel, 1974 | gas phase; Entropy change is questionable |
Quantity | Value | Units | Method | Reference | Comment |
ΔrS° | 126. | J/mol*K | PHPMS | Meot-Ner (Mautner), 1992 | gas phase |
ΔrS° | 177. | J/mol*K | HPMS | Zielinska and Wincel, 1974 | gas phase; Entropy change is questionable |
(C3H10N+ • 3) +
= (C3H10N+ • 4
)
By formula: (C3H10N+ • 3C3H9N) + C3H9N = (C3H10N+ • 4C3H9N)
Quantity | Value | Units | Method | Reference | Comment |
---|---|---|---|---|---|
ΔrH° | 32. | kJ/mol | PHPMS | Meot-Ner (Mautner), 1992 | gas phase |
Quantity | Value | Units | Method | Reference | Comment |
ΔrS° | 84.1 | J/mol*K | PHPMS | Meot-Ner (Mautner), 1992 | gas phase |
(C3H10N+ • 4) +
= (C3H10N+ • 5
)
By formula: (C3H10N+ • 4C3H9N) + C3H9N = (C3H10N+ • 5C3H9N)
Quantity | Value | Units | Method | Reference | Comment |
---|---|---|---|---|---|
ΔrH° | 30. | kJ/mol | PHPMS | Meot-Ner (Mautner), 1992 | gas phase; Entropy change calculated or estimated |
Quantity | Value | Units | Method | Reference | Comment |
ΔrS° | 92. | J/mol*K | N/A | Meot-Ner (Mautner), 1992 | gas phase; Entropy change calculated or estimated |
Free energy of reaction
ΔrG° (kJ/mol) | T (K) | Method | Reference | Comment |
---|---|---|---|---|
14. | 174. | PHPMS | Meot-Ner (Mautner), 1992 | gas phase; Entropy change calculated or estimated |
By formula: C3H10N+ + H2O = (C3H10N+ • H2O)
Bond type: Hydrogen bond (positive ion to hydride)
Quantity | Value | Units | Method | Reference | Comment |
---|---|---|---|---|---|
ΔrH° | 65.3 | kJ/mol | ES/HPMS | Blades, Klassen, et al., 1996 | gas phase |
ΔrH° | 63.2 | kJ/mol | PHPMS | Meot-Ner (Mautner), 1984 | gas phase |
Quantity | Value | Units | Method | Reference | Comment |
ΔrS° | 95.4 | J/mol*K | ES/HPMS | Blades, Klassen, et al., 1996 | gas phase |
ΔrS° | 90.0 | J/mol*K | PHPMS | Meot-Ner (Mautner), 1984 | gas phase |
Quantity | Value | Units | Method | Reference | Comment |
ΔrG° | 37. | kJ/mol | ES/HPMS | Blades, Klassen, et al., 1996 | gas phase |
(C3H10N+ • ) +
= (C3H10N+ • 2
)
By formula: (C3H10N+ • H2O) + H2O = (C3H10N+ • 2H2O)
Bond type: Hydrogen bond (positive ion to hydride)
Quantity | Value | Units | Method | Reference | Comment |
---|---|---|---|---|---|
ΔrH° | 48.5 | kJ/mol | PHPMS | Meot-Ner (Mautner), 1984 | gas phase |
Quantity | Value | Units | Method | Reference | Comment |
ΔrS° | 89.1 | J/mol*K | PHPMS | Meot-Ner (Mautner), 1984 | gas phase |
Free energy of reaction
ΔrG° (kJ/mol) | T (K) | Method | Reference | Comment |
---|---|---|---|---|
27. | 293. | ES/HPMS | Blades, Klassen, et al., 1995 | gas phase |
(C3H10N+ • 2) +
= (C3H10N+ • 3
)
By formula: (C3H10N+ • 2H2O) + H2O = (C3H10N+ • 3H2O)
Bond type: Hydrogen bond (positive ion to hydride)
Quantity | Value | Units | Method | Reference | Comment |
---|---|---|---|---|---|
ΔrH° | 43.1 | kJ/mol | PHPMS | Meot-Ner (Mautner), 1984 | gas phase |
Quantity | Value | Units | Method | Reference | Comment |
ΔrS° | 96.7 | J/mol*K | PHPMS | Meot-Ner (Mautner), 1984 | gas phase |
Free energy of reaction
ΔrG° (kJ/mol) | T (K) | Method | Reference | Comment |
---|---|---|---|---|
19. | 293. | ES/HPMS | Blades, Klassen, et al., 1995 | gas phase |
(C3H10N+ • 3) +
= (C3H10N+ • 4
)
By formula: (C3H10N+ • 3H2O) + H2O = (C3H10N+ • 4H2O)
Bond type: Hydrogen bond (positive ion to hydride)
Quantity | Value | Units | Method | Reference | Comment |
---|---|---|---|---|---|
ΔrH° | 41. | kJ/mol | PHPMS | Meot-Ner (Mautner), 1984 | gas phase |
Quantity | Value | Units | Method | Reference | Comment |
ΔrS° | 104. | J/mol*K | PHPMS | Meot-Ner (Mautner), 1984 | gas phase |

References

Blades, Klassen, et al., 1996
Blades, A.T.; Klassen, J.S.; Kebarle, P.,
Determination of Ion-Solvent Equilibria in the Gas Phase. Hydration of Diprotonated Diamines and Bis(trimethylammonium) Alkanes,
J. Am. Chem. Soc., 1996, 118, 49, 12437, https://doi.org/10.1021/ja962641t
. [all data]
Meot-Ner (Mautner), 1984
Meot-Ner (Mautner), M.,
The Ionic Hydrogen Bond and Ion Solvation. 2. Hydration of Onium Ions by 1 - 7 H2O Molecules. Relations Between Monomolecular, Specific and Bulk Hydration,
J. Am. Chem. Soc., 1984, 106, 5, 1265, https://doi.org/10.1021/ja00317a016
. [all data]
Meot-Ner (Mautner), 1992
Meot-Ner (Mautner), M.,
Intermolecular Forces in Organic Clusters,
J. Am. Chem. Soc., 1992, 114, 9, 3312, https://doi.org/10.1021/ja00035a024
. [all data]
Zielinska and Wincel, 1974
Zielinska, T.J.; Wincel, H.,
Gas - Phase Solvation of Protonated Aliphatic Amines: Methyl, Ethyl, n - Propyl, and Iso - Propylamine,
Chem. Phys. Lett., 1974, 25, 354. [all data]
Blades, Klassen, et al., 1995
Blades, A.T.; Klassen, J.S.; Kebarle, P.,
Free Energies of Hydration in the Gas Phase on the Anions of Some Oxo Acids of C, N, S, P, Cl and I,
J. Am. Chem. Soc., 1995, 117, 42, 10563, https://doi.org/10.1021/ja00147a019
. [all data]