Trimethylamine, protonated

Reaction thermochemistry data

Data compiled by: Michael M. Meot-Ner (Mautner) and Sharon G. Lias

Individual Reactions

(C3H10N+ • 3Water) + Water = (C3H10N+ • 4Water)

By formula: (C3H10N+ • 3H2O) + H2O = (C3H10N+ • 4H2O)

Bond type: Hydrogen bond (positive ion to hydride)

Quantity Value Units Method Reference Comment
Δr8.4kcal/molPHPMSMeot-Ner (Mautner), 1984gas phase; Entropy change calculated or estimated, attributed to MeNH3+.4H2O by error in footnote
Quantity Value Units Method Reference Comment
Δr21.6cal/mol*KN/AMeot-Ner (Mautner), 1984gas phase; Entropy change calculated or estimated, attributed to MeNH3+.4H2O by error in footnote

Free energy of reaction

ΔrG° (kcal/mol) T (K) Method Reference Comment
3.0254.PHPMSMeot-Ner (Mautner), 1984gas phase; Entropy change calculated or estimated, attributed to MeNH3+.4H2O by error in footnote

C3H10N+ + Water = (C3H10N+ • Water)

By formula: C3H10N+ + H2O = (C3H10N+ • H2O)

Bond type: Hydrogen bond (positive ion to hydride)

Quantity Value Units Method Reference Comment
Δr14.5kcal/molPHPMSEl-Shall, Daly, et al., 1992gas phase
Δr14.5kcal/molPHPMSMeot-Ner (Mautner), 1984gas phase
Δr14.5kcal/molPHPMSMeot-Ner M. and Sieck, 1983gas phase
Quantity Value Units Method Reference Comment
Δr24.4cal/mol*KPHPMSEl-Shall, Daly, et al., 1992gas phase
Δr24.1cal/mol*KPHPMSMeot-Ner (Mautner), 1984gas phase
Δr24.1cal/mol*KPHPMSMeot-Ner M. and Sieck, 1983gas phase
Quantity Value Units Method Reference Comment
Δr7.6kcal/molHPMSBanic and Iribarne, 1985gas phase; electric fields

C3H10N+ + Methylamine, N,N-dimethyl- = (C3H10N+ • Methylamine, N,N-dimethyl-)

By formula: C3H10N+ + C3H9N = (C3H10N+ • C3H9N)

Quantity Value Units Method Reference Comment
Δr22.0kcal/molPHPMSEl-Shall, Daly, et al., 1992gas phase
Δr22.0kcal/molPHPMSMeot-Ner (Mautner), 1992gas phase
Δr22.6kcal/molMKERWei, Tzeng, et al., 1991gas phase; from graph
Δr22.5kcal/molPHPMSYamdagni and Kebarle, 1973gas phase
Quantity Value Units Method Reference Comment
Δr27.2cal/mol*KPHPMSEl-Shall, Daly, et al., 1992gas phase
Δr27.2cal/mol*KPHPMSMeot-Ner (Mautner), 1992gas phase
Δr32.0cal/mol*KPHPMSYamdagni and Kebarle, 1973gas phase

C3H10N+ + 1,4,7,10,13,16-Hexaoxacyclooctadecane = (C3H10N+ • 1,4,7,10,13,16-Hexaoxacyclooctadecane)

By formula: C3H10N+ + C12H24O6 = (C3H10N+ • C12H24O6)

Bond type: Hydrogen bonds with polydentate bonding in positive ions

Quantity Value Units Method Reference Comment
Δr41.kcal/molPHPMSMeot-Ner (Mautner), 1983gas phase; Entropy change calculated or estimated
Quantity Value Units Method Reference Comment
Δr40.cal/mol*KN/AMeot-Ner (Mautner), 1983gas phase; Entropy change calculated or estimated

Free energy of reaction

ΔrG° (kcal/mol) T (K) Method Reference Comment
18.569.PHPMSMeot-Ner (Mautner), 1983gas phase; Entropy change calculated or estimated

(C3H10N+ • Water • Methylamine, N,N-dimethyl-) + Water = (C3H10N+ • 2Water • Methylamine, N,N-dimethyl-)

By formula: (C3H10N+ • H2O • C3H9N) + H2O = (C3H10N+ • 2H2O • C3H9N)

Quantity Value Units Method Reference Comment
Δr8.1kcal/molPHPMSEl-Shall, Daly, et al., 1992gas phase; Entropy change calculated or estimated
Quantity Value Units Method Reference Comment
Δr25.cal/mol*KN/AEl-Shall, Daly, et al., 1992gas phase; Entropy change calculated or estimated

Free energy of reaction

ΔrG° (kcal/mol) T (K) Method Reference Comment
2.5225.PHPMSEl-Shall, Daly, et al., 1992gas phase; Entropy change calculated or estimated

C3H10N+ + N,N-Dimethylacetamide = (C3H10N+ • N,N-Dimethylacetamide)

By formula: C3H10N+ + C4H9NO = (C3H10N+ • C4H9NO)

Bond type: Hydrogen bonds of the type NH+-O between organics

Quantity Value Units Method Reference Comment
Δr27.2kcal/molPHPMSMeot-Ner, 1984gas phase
Δr27.2kcal/molPHPMSMeot-Ner, 1984, 2gas phase
Quantity Value Units Method Reference Comment
Δr24.1cal/mol*KPHPMSMeot-Ner, 1984gas phase
Δr24.1cal/mol*KPHPMSMeot-Ner, 1984, 2gas phase

(C3H10N+ • 2Water) + Water = (C3H10N+ • 3Water)

By formula: (C3H10N+ • 2H2O) + H2O = (C3H10N+ • 3H2O)

Bond type: Hydrogen bond (positive ion to hydride)

Quantity Value Units Method Reference Comment
Δr10.0kcal/molPHPMSMeot-Ner (Mautner), 1984gas phase
Quantity Value Units Method Reference Comment
Δr24.9cal/mol*KPHPMSMeot-Ner (Mautner), 1984gas phase
Quantity Value Units Method Reference Comment
Δr3.4kcal/molHPMSBanic and Iribarne, 1985gas phase; electric fields

(C3H10N+ • Water) + Water = (C3H10N+ • 2Water)

By formula: (C3H10N+ • H2O) + H2O = (C3H10N+ • 2H2O)

Bond type: Hydrogen bond (positive ion to hydride)

Quantity Value Units Method Reference Comment
Δr11.4kcal/molPHPMSMeot-Ner (Mautner), 1984gas phase
Quantity Value Units Method Reference Comment
Δr24.8cal/mol*KPHPMSMeot-Ner (Mautner), 1984gas phase
Quantity Value Units Method Reference Comment
Δr4.3kcal/molHPMSBanic and Iribarne, 1985gas phase; electric fields

C3H10N+ + 2,5,8,11-Tetraoxadodecane = (C3H10N+ • 2,5,8,11-Tetraoxadodecane)

By formula: C3H10N+ + C8H18O4 = (C3H10N+ • C8H18O4)

Bond type: Hydrogen bonds with polydentate bonding in positive ions

Quantity Value Units Method Reference Comment
Δr34.6kcal/molPHPMSMeot-Ner (Mautner), 1983gas phase; triglyme
Quantity Value Units Method Reference Comment
Δr40.0cal/mol*KPHPMSMeot-Ner (Mautner), 1983gas phase; triglyme

C3H10N+ + Ethane, 1,1'-oxybis[2-methoxy- = (C3H10N+ • Ethane, 1,1'-oxybis[2-methoxy-)

By formula: C3H10N+ + C6H14O3 = (C3H10N+ • C6H14O3)

Bond type: Hydrogen bonds with polydentate bonding in positive ions

Quantity Value Units Method Reference Comment
Δr32.8kcal/molPHPMSMeot-Ner (Mautner), 1983gas phase; diglyme
Quantity Value Units Method Reference Comment
Δr40.0cal/mol*KPHPMSMeot-Ner (Mautner), 1983gas phase; diglyme

(C3H10N+ • Methylamine, N,N-dimethyl-) + Methyl Alcohol = (C3H10N+ • Methyl Alcohol • Methylamine, N,N-dimethyl-)

By formula: (C3H10N+ • C3H9N) + CH4O = (C3H10N+ • CH4O • C3H9N)

Bond type: Hydrogen bonds of the type NH+-O between organics

Quantity Value Units Method Reference Comment
Δr10.6kcal/molPHPMSEl-Shall, Daly, et al., 1992gas phase
Quantity Value Units Method Reference Comment
Δr25.2cal/mol*KPHPMSEl-Shall, Daly, et al., 1992gas phase

(C3H10N+ • 2Methyl Alcohol) + Methyl Alcohol = (C3H10N+ • 3Methyl Alcohol)

By formula: (C3H10N+ • 2CH4O) + CH4O = (C3H10N+ • 3CH4O)

Bond type: Hydrogen bonds of the type NH+-O between organics

Quantity Value Units Method Reference Comment
Δr10.5kcal/molPHPMSEl-Shall, Daly, et al., 1992gas phase
Quantity Value Units Method Reference Comment
Δr27.0cal/mol*KPHPMSEl-Shall, Daly, et al., 1992gas phase

(C3H10N+ • 2Methylamine, N,N-dimethyl-) + Water = (C3H10N+ • Water • 2Methylamine, N,N-dimethyl-)

By formula: (C3H10N+ • 2C3H9N) + H2O = (C3H10N+ • H2O • 2C3H9N)

Bond type: Hydrogen bond (positive ion to hydride)

Quantity Value Units Method Reference Comment
Δr8.9kcal/molPHPMSEl-Shall, Daly, et al., 1992gas phase
Quantity Value Units Method Reference Comment
Δr24.3cal/mol*KPHPMSEl-Shall, Daly, et al., 1992gas phase

(C3H10N+ • Methyl Alcohol) + Methyl Alcohol = (C3H10N+ • 2Methyl Alcohol)

By formula: (C3H10N+ • CH4O) + CH4O = (C3H10N+ • 2CH4O)

Bond type: Hydrogen bonds of the type NH+-O between organics

Quantity Value Units Method Reference Comment
Δr11.7kcal/molPHPMSEl-Shall, Daly, et al., 1992gas phase
Quantity Value Units Method Reference Comment
Δr23.8cal/mol*KPHPMSEl-Shall, Daly, et al., 1992gas phase

C3H10N+ + Propane, 1,3-dimethoxy- = (C3H10N+ • Propane, 1,3-dimethoxy-)

By formula: C3H10N+ + C5H12O2 = (C3H10N+ • C5H12O2)

Bond type: Hydrogen bonds with polydentate bonding in positive ions

Quantity Value Units Method Reference Comment
Δr25.5kcal/molPHPMSMeot-Ner (Mautner), 1983gas phase
Quantity Value Units Method Reference Comment
Δr33.1cal/mol*KPHPMSMeot-Ner (Mautner), 1983gas phase

C3H10N+ + 15-Crown-5 = (C3H10N+ • 15-Crown-5)

By formula: C3H10N+ + C10H20O5 = (C3H10N+ • C10H20O5)

Bond type: Hydrogen bonds with polydentate bonding in positive ions

Quantity Value Units Method Reference Comment
Δr34.9kcal/molPHPMSMeot-Ner (Mautner), 1983gas phase
Quantity Value Units Method Reference Comment
Δr35.6cal/mol*KPHPMSMeot-Ner (Mautner), 1983gas phase

C3H10N+ + Ethane, 1,2-dimethoxy- = (C3H10N+ • Ethane, 1,2-dimethoxy-)

By formula: C3H10N+ + C4H10O2 = (C3H10N+ • C4H10O2)

Bond type: Hydrogen bonds with polydentate bonding in positive ions

Quantity Value Units Method Reference Comment
Δr26.7kcal/molPHPMSMeot-Ner (Mautner), 1983gas phase
Quantity Value Units Method Reference Comment
Δr34.8cal/mol*KPHPMSMeot-Ner (Mautner), 1983gas phase

C3H10N+ + 12-Crown-4 = (C3H10N+ • 12-Crown-4)

By formula: C3H10N+ + C8H16O4 = (C3H10N+ • C8H16O4)

Bond type: Hydrogen bonds with polydentate bonding in positive ions

Quantity Value Units Method Reference Comment
Δr35.8kcal/molPHPMSMeot-Ner (Mautner), 1983gas phase
Quantity Value Units Method Reference Comment
Δr41.5cal/mol*KPHPMSMeot-Ner (Mautner), 1983gas phase

C3H10N+ + L-Alanine, N-acetyl-, methyl ester = (C3H10N+ • L-Alanine, N-acetyl-, methyl ester)

By formula: C3H10N+ + C6H11NO3 = (C3H10N+ • C6H11NO3)

Bond type: Hydrogen bonds with polydentate bonding in positive ions

Quantity Value Units Method Reference Comment
Δr29.7kcal/molPHPMSMeot-Ner, 1984, 2gas phase
Quantity Value Units Method Reference Comment
Δr27.6cal/mol*KPHPMSMeot-Ner, 1984, 2gas phase

C3H10N+ + Methyl Alcohol = (C3H10N+ • Methyl Alcohol)

By formula: C3H10N+ + CH4O = (C3H10N+ • CH4O)

Bond type: Hydrogen bonds of the type NH+-O between organics

Quantity Value Units Method Reference Comment
Δr15.1kcal/molPHPMSEl-Shall, Daly, et al., 1992gas phase
Quantity Value Units Method Reference Comment
Δr21.0cal/mol*KPHPMSEl-Shall, Daly, et al., 1992gas phase

C3H10N+ + 3-Pentanone = (C3H10N+ • 3-Pentanone)

By formula: C3H10N+ + C5H10O = (C3H10N+ • C5H10O)

Bond type: Hydrogen bonds of the type NH+-O between organics

Quantity Value Units Method Reference Comment
Δr19.5kcal/molPHPMSMeot-Ner (Mautner), 1983gas phase
Quantity Value Units Method Reference Comment
Δr29.4cal/mol*KPHPMSMeot-Ner (Mautner), 1983gas phase

(C3H10N+ • Methyl Alcohol • Methylamine, N,N-dimethyl-) + Methyl Alcohol = (C3H10N+ • 2Methyl Alcohol • Methylamine, N,N-dimethyl-)

By formula: (C3H10N+ • CH4O • C3H9N) + CH4O = (C3H10N+ • 2CH4O • C3H9N)

Bond type: Hydrogen bonds of the type NH+-O between organics

Quantity Value Units Method Reference Comment
Δr9.5kcal/molPHPMSEl-Shall, Daly, et al., 1992gas phase

C3H10N+ + Dimethylamine = (C3H10N+ • Dimethylamine)

By formula: C3H10N+ + C2H7N = (C3H10N+ • C2H7N)

Quantity Value Units Method Reference Comment
Δr20.5kcal/molPHPMSYamdagni and Kebarle, 1973gas phase
Quantity Value Units Method Reference Comment
Δr28.5cal/mol*KPHPMSYamdagni and Kebarle, 1973gas phase

C3H10N+ + Hydrogen cyanide = (C3H10N+ • Hydrogen cyanide)

By formula: C3H10N+ + CHN = (C3H10N+ • CHN)

Quantity Value Units Method Reference Comment
Δr16.8kcal/molPHPMSSpeller and Meot-Ner (Mautner), 1985gas phase
Quantity Value Units Method Reference Comment
Δr23.0cal/mol*KPHPMSSpeller and Meot-Ner (Mautner), 1985gas phase

C3H10N+ + Benzene = (C3H10N+ • Benzene)

By formula: C3H10N+ + C6H6 = (C3H10N+ • C6H6)

Quantity Value Units Method Reference Comment
Δr15.9kcal/molPHPMSDeakyne and Meot-Ner (Mautner), 1985gas phase
Quantity Value Units Method Reference Comment
Δr27.7cal/mol*KPHPMSDeakyne and Meot-Ner (Mautner), 1985gas phase

(C3H10N+ • Methylamine, N,N-dimethyl- • Water) + Methylamine, N,N-dimethyl- = (C3H10N+ • 2Methylamine, N,N-dimethyl- • Water)

By formula: (C3H10N+ • C3H9N • H2O) + C3H9N = (C3H10N+ • 2C3H9N • H2O)

Quantity Value Units Method Reference Comment
Δr11.0kcal/molPHPMSEl-Shall, Daly, et al., 1992gas phase

(C3H10N+ • 2Methylamine, N,N-dimethyl-) + Methylamine, N,N-dimethyl- = (C3H10N+ • 3Methylamine, N,N-dimethyl-)

By formula: (C3H10N+ • 2C3H9N) + C3H9N = (C3H10N+ • 3C3H9N)

Quantity Value Units Method Reference Comment
Δr6.5kcal/molMKERWei, Tzeng, et al., 1991gas phase; from graph

(C3H10N+ • 3Methylamine, N,N-dimethyl-) + Methylamine, N,N-dimethyl- = (C3H10N+ • 4Methylamine, N,N-dimethyl-)

By formula: (C3H10N+ • 3C3H9N) + C3H9N = (C3H10N+ • 4C3H9N)

Quantity Value Units Method Reference Comment
Δr8.3kcal/molMKERWei, Tzeng, et al., 1991gas phase; from graph

(C3H10N+ • 4Methylamine, N,N-dimethyl-) + Methylamine, N,N-dimethyl- = (C3H10N+ • 5Methylamine, N,N-dimethyl-)

By formula: (C3H10N+ • 4C3H9N) + C3H9N = (C3H10N+ • 5C3H9N)

Quantity Value Units Method Reference Comment
Δr8.8kcal/molMKERWei, Tzeng, et al., 1991gas phase; from graph

(C3H10N+ • 5Methylamine, N,N-dimethyl-) + Methylamine, N,N-dimethyl- = (C3H10N+ • 6Methylamine, N,N-dimethyl-)

By formula: (C3H10N+ • 5C3H9N) + C3H9N = (C3H10N+ • 6C3H9N)

Quantity Value Units Method Reference Comment
Δr7.4kcal/molMKERWei, Tzeng, et al., 1991gas phase; from graph

(C3H10N+ • Methylamine, N,N-dimethyl-) + Methylamine, N,N-dimethyl- = (C3H10N+ • 2Methylamine, N,N-dimethyl-)

By formula: (C3H10N+ • C3H9N) + C3H9N = (C3H10N+ • 2C3H9N)

Quantity Value Units Method Reference Comment
Δr6.9kcal/molMKERWei, Tzeng, et al., 1991gas phase; from graph

Ion clustering data

Data compiled by: Michael M. Meot-Ner (Mautner) and Sharon G. Lias

Clustering reactions

C3H10N+ + Hydrogen cyanide = (C3H10N+ • Hydrogen cyanide)

By formula: C3H10N+ + CHN = (C3H10N+ • CHN)

Quantity Value Units Method Reference Comment
Δr16.8kcal/molPHPMSSpeller and Meot-Ner (Mautner), 1985gas phase
Quantity Value Units Method Reference Comment
Δr23.0cal/mol*KPHPMSSpeller and Meot-Ner (Mautner), 1985gas phase

C3H10N+ + Methyl Alcohol = (C3H10N+ • Methyl Alcohol)

By formula: C3H10N+ + CH4O = (C3H10N+ • CH4O)

Bond type: Hydrogen bonds of the type NH+-O between organics

Quantity Value Units Method Reference Comment
Δr15.1kcal/molPHPMSEl-Shall, Daly, et al., 1992gas phase
Quantity Value Units Method Reference Comment
Δr21.0cal/mol*KPHPMSEl-Shall, Daly, et al., 1992gas phase

(C3H10N+ • Methyl Alcohol) + Methyl Alcohol = (C3H10N+ • 2Methyl Alcohol)

By formula: (C3H10N+ • CH4O) + CH4O = (C3H10N+ • 2CH4O)

Bond type: Hydrogen bonds of the type NH+-O between organics

Quantity Value Units Method Reference Comment
Δr11.7kcal/molPHPMSEl-Shall, Daly, et al., 1992gas phase
Quantity Value Units Method Reference Comment
Δr23.8cal/mol*KPHPMSEl-Shall, Daly, et al., 1992gas phase

(C3H10N+ • 2Methyl Alcohol) + Methyl Alcohol = (C3H10N+ • 3Methyl Alcohol)

By formula: (C3H10N+ • 2CH4O) + CH4O = (C3H10N+ • 3CH4O)

Bond type: Hydrogen bonds of the type NH+-O between organics

Quantity Value Units Method Reference Comment
Δr10.5kcal/molPHPMSEl-Shall, Daly, et al., 1992gas phase
Quantity Value Units Method Reference Comment
Δr27.0cal/mol*KPHPMSEl-Shall, Daly, et al., 1992gas phase

(C3H10N+ • Methyl Alcohol • Methylamine, N,N-dimethyl-) + Methyl Alcohol = (C3H10N+ • 2Methyl Alcohol • Methylamine, N,N-dimethyl-)

By formula: (C3H10N+ • CH4O • C3H9N) + CH4O = (C3H10N+ • 2CH4O • C3H9N)

Bond type: Hydrogen bonds of the type NH+-O between organics

Quantity Value Units Method Reference Comment
Δr9.5kcal/molPHPMSEl-Shall, Daly, et al., 1992gas phase

C3H10N+ + Dimethylamine = (C3H10N+ • Dimethylamine)

By formula: C3H10N+ + C2H7N = (C3H10N+ • C2H7N)

Quantity Value Units Method Reference Comment
Δr20.5kcal/molPHPMSYamdagni and Kebarle, 1973gas phase
Quantity Value Units Method Reference Comment
Δr28.5cal/mol*KPHPMSYamdagni and Kebarle, 1973gas phase

C3H10N+ + Methylamine, N,N-dimethyl- = (C3H10N+ • Methylamine, N,N-dimethyl-)

By formula: C3H10N+ + C3H9N = (C3H10N+ • C3H9N)

Quantity Value Units Method Reference Comment
Δr22.0kcal/molPHPMSEl-Shall, Daly, et al., 1992gas phase
Δr22.0kcal/molPHPMSMeot-Ner (Mautner), 1992gas phase
Δr22.6kcal/molMKERWei, Tzeng, et al., 1991gas phase; from graph
Δr22.5kcal/molPHPMSYamdagni and Kebarle, 1973gas phase
Quantity Value Units Method Reference Comment
Δr27.2cal/mol*KPHPMSEl-Shall, Daly, et al., 1992gas phase
Δr27.2cal/mol*KPHPMSMeot-Ner (Mautner), 1992gas phase
Δr32.0cal/mol*KPHPMSYamdagni and Kebarle, 1973gas phase

(C3H10N+ • Methylamine, N,N-dimethyl-) + Methyl Alcohol = (C3H10N+ • Methyl Alcohol • Methylamine, N,N-dimethyl-)

By formula: (C3H10N+ • C3H9N) + CH4O = (C3H10N+ • CH4O • C3H9N)

Bond type: Hydrogen bonds of the type NH+-O between organics

Quantity Value Units Method Reference Comment
Δr10.6kcal/molPHPMSEl-Shall, Daly, et al., 1992gas phase
Quantity Value Units Method Reference Comment
Δr25.2cal/mol*KPHPMSEl-Shall, Daly, et al., 1992gas phase

(C3H10N+ • Methylamine, N,N-dimethyl-) + Methylamine, N,N-dimethyl- = (C3H10N+ • 2Methylamine, N,N-dimethyl-)

By formula: (C3H10N+ • C3H9N) + C3H9N = (C3H10N+ • 2C3H9N)

Quantity Value Units Method Reference Comment
Δr6.9kcal/molMKERWei, Tzeng, et al., 1991gas phase; from graph

(C3H10N+ • 2Methylamine, N,N-dimethyl-) + Methylamine, N,N-dimethyl- = (C3H10N+ • 3Methylamine, N,N-dimethyl-)

By formula: (C3H10N+ • 2C3H9N) + C3H9N = (C3H10N+ • 3C3H9N)

Quantity Value Units Method Reference Comment
Δr6.5kcal/molMKERWei, Tzeng, et al., 1991gas phase; from graph

(C3H10N+ • 3Methylamine, N,N-dimethyl-) + Methylamine, N,N-dimethyl- = (C3H10N+ • 4Methylamine, N,N-dimethyl-)

By formula: (C3H10N+ • 3C3H9N) + C3H9N = (C3H10N+ • 4C3H9N)

Quantity Value Units Method Reference Comment
Δr8.3kcal/molMKERWei, Tzeng, et al., 1991gas phase; from graph

(C3H10N+ • 4Methylamine, N,N-dimethyl-) + Methylamine, N,N-dimethyl- = (C3H10N+ • 5Methylamine, N,N-dimethyl-)

By formula: (C3H10N+ • 4C3H9N) + C3H9N = (C3H10N+ • 5C3H9N)

Quantity Value Units Method Reference Comment
Δr8.8kcal/molMKERWei, Tzeng, et al., 1991gas phase; from graph

(C3H10N+ • 5Methylamine, N,N-dimethyl-) + Methylamine, N,N-dimethyl- = (C3H10N+ • 6Methylamine, N,N-dimethyl-)

By formula: (C3H10N+ • 5C3H9N) + C3H9N = (C3H10N+ • 6C3H9N)

Quantity Value Units Method Reference Comment
Δr7.4kcal/molMKERWei, Tzeng, et al., 1991gas phase; from graph

(C3H10N+ • 2Methylamine, N,N-dimethyl-) + Water = (C3H10N+ • Water • 2Methylamine, N,N-dimethyl-)

By formula: (C3H10N+ • 2C3H9N) + H2O = (C3H10N+ • H2O • 2C3H9N)

Bond type: Hydrogen bond (positive ion to hydride)

Quantity Value Units Method Reference Comment
Δr8.9kcal/molPHPMSEl-Shall, Daly, et al., 1992gas phase
Quantity Value Units Method Reference Comment
Δr24.3cal/mol*KPHPMSEl-Shall, Daly, et al., 1992gas phase

(C3H10N+ • Methylamine, N,N-dimethyl- • Water) + Methylamine, N,N-dimethyl- = (C3H10N+ • 2Methylamine, N,N-dimethyl- • Water)

By formula: (C3H10N+ • C3H9N • H2O) + C3H9N = (C3H10N+ • 2C3H9N • H2O)

Quantity Value Units Method Reference Comment
Δr11.0kcal/molPHPMSEl-Shall, Daly, et al., 1992gas phase

C3H10N+ + N,N-Dimethylacetamide = (C3H10N+ • N,N-Dimethylacetamide)

By formula: C3H10N+ + C4H9NO = (C3H10N+ • C4H9NO)

Bond type: Hydrogen bonds of the type NH+-O between organics

Quantity Value Units Method Reference Comment
Δr27.2kcal/molPHPMSMeot-Ner, 1984gas phase
Δr27.2kcal/molPHPMSMeot-Ner, 1984, 2gas phase
Quantity Value Units Method Reference Comment
Δr24.1cal/mol*KPHPMSMeot-Ner, 1984gas phase
Δr24.1cal/mol*KPHPMSMeot-Ner, 1984, 2gas phase

C3H10N+ + Ethane, 1,2-dimethoxy- = (C3H10N+ • Ethane, 1,2-dimethoxy-)

By formula: C3H10N+ + C4H10O2 = (C3H10N+ • C4H10O2)

Bond type: Hydrogen bonds with polydentate bonding in positive ions

Quantity Value Units Method Reference Comment
Δr26.7kcal/molPHPMSMeot-Ner (Mautner), 1983gas phase
Quantity Value Units Method Reference Comment
Δr34.8cal/mol*KPHPMSMeot-Ner (Mautner), 1983gas phase

C3H10N+ + 3-Pentanone = (C3H10N+ • 3-Pentanone)

By formula: C3H10N+ + C5H10O = (C3H10N+ • C5H10O)

Bond type: Hydrogen bonds of the type NH+-O between organics

Quantity Value Units Method Reference Comment
Δr19.5kcal/molPHPMSMeot-Ner (Mautner), 1983gas phase
Quantity Value Units Method Reference Comment
Δr29.4cal/mol*KPHPMSMeot-Ner (Mautner), 1983gas phase

C3H10N+ + Propane, 1,3-dimethoxy- = (C3H10N+ • Propane, 1,3-dimethoxy-)

By formula: C3H10N+ + C5H12O2 = (C3H10N+ • C5H12O2)

Bond type: Hydrogen bonds with polydentate bonding in positive ions

Quantity Value Units Method Reference Comment
Δr25.5kcal/molPHPMSMeot-Ner (Mautner), 1983gas phase
Quantity Value Units Method Reference Comment
Δr33.1cal/mol*KPHPMSMeot-Ner (Mautner), 1983gas phase

C3H10N+ + Benzene = (C3H10N+ • Benzene)

By formula: C3H10N+ + C6H6 = (C3H10N+ • C6H6)

Quantity Value Units Method Reference Comment
Δr15.9kcal/molPHPMSDeakyne and Meot-Ner (Mautner), 1985gas phase
Quantity Value Units Method Reference Comment
Δr27.7cal/mol*KPHPMSDeakyne and Meot-Ner (Mautner), 1985gas phase

C3H10N+ + L-Alanine, N-acetyl-, methyl ester = (C3H10N+ • L-Alanine, N-acetyl-, methyl ester)

By formula: C3H10N+ + C6H11NO3 = (C3H10N+ • C6H11NO3)

Bond type: Hydrogen bonds with polydentate bonding in positive ions

Quantity Value Units Method Reference Comment
Δr29.7kcal/molPHPMSMeot-Ner, 1984, 2gas phase
Quantity Value Units Method Reference Comment
Δr27.6cal/mol*KPHPMSMeot-Ner, 1984, 2gas phase

C3H10N+ + Ethane, 1,1'-oxybis[2-methoxy- = (C3H10N+ • Ethane, 1,1'-oxybis[2-methoxy-)

By formula: C3H10N+ + C6H14O3 = (C3H10N+ • C6H14O3)

Bond type: Hydrogen bonds with polydentate bonding in positive ions

Quantity Value Units Method Reference Comment
Δr32.8kcal/molPHPMSMeot-Ner (Mautner), 1983gas phase; diglyme
Quantity Value Units Method Reference Comment
Δr40.0cal/mol*KPHPMSMeot-Ner (Mautner), 1983gas phase; diglyme

C3H10N+ + 12-Crown-4 = (C3H10N+ • 12-Crown-4)

By formula: C3H10N+ + C8H16O4 = (C3H10N+ • C8H16O4)

Bond type: Hydrogen bonds with polydentate bonding in positive ions

Quantity Value Units Method Reference Comment
Δr35.8kcal/molPHPMSMeot-Ner (Mautner), 1983gas phase
Quantity Value Units Method Reference Comment
Δr41.5cal/mol*KPHPMSMeot-Ner (Mautner), 1983gas phase

C3H10N+ + 2,5,8,11-Tetraoxadodecane = (C3H10N+ • 2,5,8,11-Tetraoxadodecane)

By formula: C3H10N+ + C8H18O4 = (C3H10N+ • C8H18O4)

Bond type: Hydrogen bonds with polydentate bonding in positive ions

Quantity Value Units Method Reference Comment
Δr34.6kcal/molPHPMSMeot-Ner (Mautner), 1983gas phase; triglyme
Quantity Value Units Method Reference Comment
Δr40.0cal/mol*KPHPMSMeot-Ner (Mautner), 1983gas phase; triglyme

C3H10N+ + 15-Crown-5 = (C3H10N+ • 15-Crown-5)

By formula: C3H10N+ + C10H20O5 = (C3H10N+ • C10H20O5)

Bond type: Hydrogen bonds with polydentate bonding in positive ions

Quantity Value Units Method Reference Comment
Δr34.9kcal/molPHPMSMeot-Ner (Mautner), 1983gas phase
Quantity Value Units Method Reference Comment
Δr35.6cal/mol*KPHPMSMeot-Ner (Mautner), 1983gas phase

C3H10N+ + 1,4,7,10,13,16-Hexaoxacyclooctadecane = (C3H10N+ • 1,4,7,10,13,16-Hexaoxacyclooctadecane)

By formula: C3H10N+ + C12H24O6 = (C3H10N+ • C12H24O6)

Bond type: Hydrogen bonds with polydentate bonding in positive ions

Quantity Value Units Method Reference Comment
Δr41.kcal/molPHPMSMeot-Ner (Mautner), 1983gas phase; Entropy change calculated or estimated
Quantity Value Units Method Reference Comment
Δr40.cal/mol*KN/AMeot-Ner (Mautner), 1983gas phase; Entropy change calculated or estimated

Free energy of reaction

ΔrG° (kcal/mol) T (K) Method Reference Comment
18.569.PHPMSMeot-Ner (Mautner), 1983gas phase; Entropy change calculated or estimated

C3H10N+ + Water = (C3H10N+ • Water)

By formula: C3H10N+ + H2O = (C3H10N+ • H2O)

Bond type: Hydrogen bond (positive ion to hydride)

Quantity Value Units Method Reference Comment
Δr14.5kcal/molPHPMSEl-Shall, Daly, et al., 1992gas phase
Δr14.5kcal/molPHPMSMeot-Ner (Mautner), 1984gas phase
Δr14.5kcal/molPHPMSMeot-Ner M. and Sieck, 1983gas phase
Quantity Value Units Method Reference Comment
Δr24.4cal/mol*KPHPMSEl-Shall, Daly, et al., 1992gas phase
Δr24.1cal/mol*KPHPMSMeot-Ner (Mautner), 1984gas phase
Δr24.1cal/mol*KPHPMSMeot-Ner M. and Sieck, 1983gas phase
Quantity Value Units Method Reference Comment
Δr7.6kcal/molHPMSBanic and Iribarne, 1985gas phase; electric fields

(C3H10N+ • Water • Methylamine, N,N-dimethyl-) + Water = (C3H10N+ • 2Water • Methylamine, N,N-dimethyl-)

By formula: (C3H10N+ • H2O • C3H9N) + H2O = (C3H10N+ • 2H2O • C3H9N)

Quantity Value Units Method Reference Comment
Δr8.1kcal/molPHPMSEl-Shall, Daly, et al., 1992gas phase; Entropy change calculated or estimated
Quantity Value Units Method Reference Comment
Δr25.cal/mol*KN/AEl-Shall, Daly, et al., 1992gas phase; Entropy change calculated or estimated

Free energy of reaction

ΔrG° (kcal/mol) T (K) Method Reference Comment
2.5225.PHPMSEl-Shall, Daly, et al., 1992gas phase; Entropy change calculated or estimated

(C3H10N+ • Water) + Water = (C3H10N+ • 2Water)

By formula: (C3H10N+ • H2O) + H2O = (C3H10N+ • 2H2O)

Bond type: Hydrogen bond (positive ion to hydride)

Quantity Value Units Method Reference Comment
Δr11.4kcal/molPHPMSMeot-Ner (Mautner), 1984gas phase
Quantity Value Units Method Reference Comment
Δr24.8cal/mol*KPHPMSMeot-Ner (Mautner), 1984gas phase
Quantity Value Units Method Reference Comment
Δr4.3kcal/molHPMSBanic and Iribarne, 1985gas phase; electric fields

(C3H10N+ • 2Water) + Water = (C3H10N+ • 3Water)

By formula: (C3H10N+ • 2H2O) + H2O = (C3H10N+ • 3H2O)

Bond type: Hydrogen bond (positive ion to hydride)

Quantity Value Units Method Reference Comment
Δr10.0kcal/molPHPMSMeot-Ner (Mautner), 1984gas phase
Quantity Value Units Method Reference Comment
Δr24.9cal/mol*KPHPMSMeot-Ner (Mautner), 1984gas phase
Quantity Value Units Method Reference Comment
Δr3.4kcal/molHPMSBanic and Iribarne, 1985gas phase; electric fields

(C3H10N+ • 3Water) + Water = (C3H10N+ • 4Water)

By formula: (C3H10N+ • 3H2O) + H2O = (C3H10N+ • 4H2O)

Bond type: Hydrogen bond (positive ion to hydride)

Quantity Value Units Method Reference Comment
Δr8.4kcal/molPHPMSMeot-Ner (Mautner), 1984gas phase; Entropy change calculated or estimated, attributed to MeNH3+.4H2O by error in footnote
Quantity Value Units Method Reference Comment
Δr21.6cal/mol*KN/AMeot-Ner (Mautner), 1984gas phase; Entropy change calculated or estimated, attributed to MeNH3+.4H2O by error in footnote

Free energy of reaction

ΔrG° (kcal/mol) T (K) Method Reference Comment
3.0254.PHPMSMeot-Ner (Mautner), 1984gas phase; Entropy change calculated or estimated, attributed to MeNH3+.4H2O by error in footnote

References

Meot-Ner (Mautner), 1984
Meot-Ner (Mautner), M., The Ionic Hydrogen Bond and Ion Solvation. 2. Hydration of Onium Ions by 1 - 7 H2O Molecules. Relations Between Monomolecular, Specific and Bulk Hydration, J. Am. Chem. Soc., 1984, 106, 5, 1265, https://doi.org/10.1021/ja00317a016 . [all data]

El-Shall, Daly, et al., 1992
El-Shall, M.S.; Daly, G.M.; Gao, J.; Meot-Ner (Mautner), M.; Sieck, L.W., How Sensitive are Cluster Compositions to Energetics? A Joint Beam Expansion/ Thermochemical Study of Water - Methanol - Trimethylamine Clusters, J. Phys. Chem., 1992, 96, 2, 507, https://doi.org/10.1021/j100181a002 . [all data]

Meot-Ner M. and Sieck, 1983
Meot-Ner M.; Sieck, L.W., The Ionic Hydrogen Bond. 1. Sterically Hindered Bonds. Solvation and Clustering of Sterically Hindered Amines and Pyridines, J. Am. Chem. Soc., 1983, 105, 10, 2956, https://doi.org/10.1021/ja00348a005 . [all data]

Banic and Iribarne, 1985
Banic, C.M.; Iribarne, J.V., Equilibrium Constants for Clustering of Neutral Molecules about Gaseous Ions, J. Chem. Phys., 1985, 83, 12, 6432, https://doi.org/10.1063/1.449543 . [all data]

Meot-Ner (Mautner), 1992
Meot-Ner (Mautner), M., Intermolecular Forces in Organic Clusters, J. Am. Chem. Soc., 1992, 114, 9, 3312, https://doi.org/10.1021/ja00035a024 . [all data]

Wei, Tzeng, et al., 1991
Wei, S.; Tzeng, W.B.; Castleman, A.W., Structure of protonated solvation complexes - ammonia trimethylamine cluster ions and their metastable decompositions, J. Phys. Chem., 1991, 95, 2, 585, https://doi.org/10.1021/j100155a019 . [all data]

Yamdagni and Kebarle, 1973
Yamdagni, R.; Kebarle, P., Gas - Phase Basicites of Amines. Hydrogen Bonding in Proton - Bound Amine Dimers and Proton - Induced Cyclization of alpha, omega - Diamines, J. Am. Chem. Soc., 1973, 95, 11, 3504, https://doi.org/10.1021/ja00792a010 . [all data]

Meot-Ner (Mautner), 1983
Meot-Ner (Mautner), M., The Ionic Hydrogen Bond. 3. Multiple and -CH+...O- Bonds. Complexes of Ammonium Ions with Polyethers and Crown Ethers, J. Am. Chem. Soc., 1983, 105, 15, 4912, https://doi.org/10.1021/ja00353a012 . [all data]

Meot-Ner, 1984
Meot-Ner, (Mautner)M., The Ionic Hydrogen Bond and Ion Solvation. 1. -NH+ O-, -NH+ N- and -OH+ O- Bonds. Correlations with Proton Affinity. Deviations Due to Structural Effects, J. Am. Chem. Soc., 1984, 106, 5, 1257, https://doi.org/10.1021/ja00317a015 . [all data]

Meot-Ner, 1984, 2
Meot-Ner, (Mautner), The Ionic Hydrogen Bond. 4. Intramolecular and Multiple Bonds. Proton Affinities, Hydration and Complexes of Amides and Amino Acid Derivatives, J. Am. Chem. Soc., 1984, 106, 2, 278, https://doi.org/10.1021/ja00314a003 . [all data]

Speller and Meot-Ner (Mautner), 1985
Speller, C.V.; Meot-Ner (Mautner), M., The Ionic Hydrogen Bond and Ion Solvation. 3. Bonds Involving Cyanides. Correlations with Proton Affinites, J. Phys. Chem., 1985, 81, 24, 5217, https://doi.org/10.1021/j100270a020 . [all data]

Deakyne and Meot-Ner (Mautner), 1985
Deakyne, C.A.; Meot-Ner (Mautner), M., Unconventional Ionic Hydrogen Bonds. 2. NH+ pi. Complexes of Onium Ions with Olefins and Benzene Derivatives, J. Am. Chem. Soc., 1985, 107, 2, 474, https://doi.org/10.1021/ja00288a034 . [all data]