Dimethyl sulfide, positive ion
- Formula: C2H6S+
- Molecular weight: 62.133

Reaction thermochemistry data

Data compiled by: Michael M. Meot-Ner (Mautner) and Sharon G. Lias
Individual Reactions
By formula: C2H6S+ + C2H6S = (C2H6S+ • C2H6S)
Bond type: Charge transfer bond (positive ion)
Quantity | Value | Units | Method | Reference | Comment |
---|---|---|---|---|---|
ΔrH° | 112. | kJ/mol | DT | Deng, Illies, et al., 1995 | gas phase; ΔrH(0K) = 115. kJ/mol |
Quantity | Value | Units | Method | Reference | Comment |
ΔrS° | 111. | J/mol*K | DT | Deng, Illies, et al., 1995 | gas phase; ΔrH(0K) = 115. kJ/mol |

Ion clustering data

Data compiled by: Michael M. Meot-Ner (Mautner) and Sharon G. Lias
Clustering reactions
By formula: C2H6S+ + C2H6S = (C2H6S+ • C2H6S)
Bond type: Charge transfer bond (positive ion)
Quantity | Value | Units | Method | Reference | Comment |
---|---|---|---|---|---|
ΔrH° | 112. | kJ/mol | DT | Deng, Illies, et al., 1995 | gas phase; ΔrH(0K) = 115. kJ/mol |
Quantity | Value | Units | Method | Reference | Comment |
ΔrS° | 111. | J/mol*K | DT | Deng, Illies, et al., 1995 | gas phase; ΔrH(0K) = 115. kJ/mol |

References

Deng, Illies, et al., 1995
Deng, Y.; Illies, A.J.; James, M.A.; McKee, M.L.; Peschke, M.,
A Definitive Investigation of the Gas-Phase Two-Center Three-electron Bond in [H2S:SH2+], [Me2S:SMe2]+, and [Et2S:SEt2]+: Therory and Experiment,
J. Am. Chem. Soc., 1995, 117, 1, 420, https://doi.org/10.1021/ja00106a048
. [all data]