Dimethyl sulfoxide, protonated
- Formula: C2H7OS+
- Molecular weight: 79.141

Reaction thermochemistry data

Data compiled by: Michael M. Meot-Ner (Mautner) and Sharon G. Lias
Individual Reactions
By formula: C2H7OS+ + C2H6OS = (C2H7OS+ • C2H6OS)
Quantity | Value | Units | Method | Reference | Comment |
---|---|---|---|---|---|
ΔrH° | 129. | kJ/mol | PHPMS | Lau, Saluja, et al., 1980 | gas phase; switching reaction((CH3)2SOH+)(CH3)2CO |
Quantity | Value | Units | Method | Reference | Comment |
ΔrS° | 95.8 | J/mol*K | PHPMS | Lau, Saluja, et al., 1980 | gas phase; switching reaction((CH3)2SOH+)(CH3)2CO |
(C2H7OS+ • ) +
= (C2H7OS+ • 2
)
By formula: (C2H7OS+ • C2H6OS) + C2H6OS = (C2H7OS+ • 2C2H6OS)
Quantity | Value | Units | Method | Reference | Comment |
---|---|---|---|---|---|
ΔrH° | 89.1 | kJ/mol | PHPMS | Lau, Saluja, et al., 1980 | gas phase; Entropy change is questionable |
Quantity | Value | Units | Method | Reference | Comment |
ΔrS° | 45.6 | J/mol*K | PHPMS | Lau, Saluja, et al., 1980 | gas phase; Entropy change is questionable |
By formula: C2H7OS+ + C3H6O = (C2H7OS+ • C3H6O)
Quantity | Value | Units | Method | Reference | Comment |
---|---|---|---|---|---|
ΔrH° | 101. | kJ/mol | PHPMS | Lau, Saluja, et al., 1980 | gas phase |
Quantity | Value | Units | Method | Reference | Comment |
ΔrS° | 103. | J/mol*K | PHPMS | Lau, Saluja, et al., 1980 | gas phase |

Ion clustering data

Data compiled by: Michael M. Meot-Ner (Mautner) and Sharon G. Lias
Clustering reactions
By formula: C2H7OS+ + C2H6OS = (C2H7OS+ • C2H6OS)
Quantity | Value | Units | Method | Reference | Comment |
---|---|---|---|---|---|
ΔrH° | 129. | kJ/mol | PHPMS | Lau, Saluja, et al., 1980 | gas phase; switching reaction((CH3)2SOH+)(CH3)2CO |
Quantity | Value | Units | Method | Reference | Comment |
ΔrS° | 95.8 | J/mol*K | PHPMS | Lau, Saluja, et al., 1980 | gas phase; switching reaction((CH3)2SOH+)(CH3)2CO |
(C2H7OS+ • ) +
= (C2H7OS+ • 2
)
By formula: (C2H7OS+ • C2H6OS) + C2H6OS = (C2H7OS+ • 2C2H6OS)
Quantity | Value | Units | Method | Reference | Comment |
---|---|---|---|---|---|
ΔrH° | 89.1 | kJ/mol | PHPMS | Lau, Saluja, et al., 1980 | gas phase; Entropy change is questionable |
Quantity | Value | Units | Method | Reference | Comment |
ΔrS° | 45.6 | J/mol*K | PHPMS | Lau, Saluja, et al., 1980 | gas phase; Entropy change is questionable |
By formula: C2H7OS+ + C3H6O = (C2H7OS+ • C3H6O)
Quantity | Value | Units | Method | Reference | Comment |
---|---|---|---|---|---|
ΔrH° | 101. | kJ/mol | PHPMS | Lau, Saluja, et al., 1980 | gas phase |
Quantity | Value | Units | Method | Reference | Comment |
ΔrS° | 103. | J/mol*K | PHPMS | Lau, Saluja, et al., 1980 | gas phase |

References

Lau, Saluja, et al., 1980
Lau, Y.K.; Saluja, P.P.S.; Kebarle, P.,
The Proton in Dimethyl Sulfoxide and Acetone. Results from Gas - Phase Ion Equilibria Involving (Me2SO)nH+ and (Me2CO)nH+,
J. Am. Chem. Soc., 1980, 102, 25, 7429, https://doi.org/10.1021/ja00545a004
. [all data]