Methyl formate, protonated
- Formula: C2H5O2+
- Molecular weight: 61.0594

Ion clustering data

Data compiled by: Michael M. Meot-Ner (Mautner) and Sharon G. Lias
Clustering reactions
By formula: C2H5O2+ + H2O = (C2H5O2+ • H2O)
Bond type: Hydrogen bond (positive ion to hydride)
Quantity | Value | Units | Method | Reference | Comment |
---|---|---|---|---|---|
ΔrH° | 21.5 | kcal/mol | PHPMS | Meot-Ner (Mautner), 1984 | gas phase |
Quantity | Value | Units | Method | Reference | Comment |
ΔrS° | 25.0 | cal/mol*K | PHPMS | Meot-Ner (Mautner), 1984 | gas phase |
(C2H5O2+ • ) +
= (C2H5O2+ • 2
)
By formula: (C2H5O2+ • H2O) + H2O = (C2H5O2+ • 2H2O)
Bond type: Hydrogen bond (positive ion to hydride)
Quantity | Value | Units | Method | Reference | Comment |
---|---|---|---|---|---|
ΔrH° | 16.2 | kcal/mol | PHPMS | Meot-Ner (Mautner), 1984 | gas phase |
Quantity | Value | Units | Method | Reference | Comment |
ΔrS° | 26.5 | cal/mol*K | PHPMS | Meot-Ner (Mautner), 1984 | gas phase |
(C2H5O2+ • 2) +
= (C2H5O2+ • 3
)
By formula: (C2H5O2+ • 2H2O) + H2O = (C2H5O2+ • 3H2O)
Bond type: Hydrogen bond (positive ion to hydride)
Quantity | Value | Units | Method | Reference | Comment |
---|---|---|---|---|---|
ΔrH° | 13.6 | kcal/mol | PHPMS | Meot-Ner (Mautner), 1984 | gas phase |
Quantity | Value | Units | Method | Reference | Comment |
ΔrS° | 21.4 | cal/mol*K | PHPMS | Meot-Ner (Mautner), 1984 | gas phase |
(C2H5O2+ • 3) +
= (C2H5O2+ • 4
)
By formula: (C2H5O2+ • 3H2O) + H2O = (C2H5O2+ • 4H2O)
Bond type: Hydrogen bond (positive ion to hydride)
Quantity | Value | Units | Method | Reference | Comment |
---|---|---|---|---|---|
ΔrH° | 11.0 | kcal/mol | PHPMS | Meot-Ner (Mautner), 1984 | gas phase; Entropy change calculated or estimated |
Quantity | Value | Units | Method | Reference | Comment |
ΔrS° | 21.6 | cal/mol*K | N/A | Meot-Ner (Mautner), 1984 | gas phase; Entropy change calculated or estimated |
Free energy of reaction
ΔrG° (kcal/mol) | T (K) | Method | Reference | Comment |
---|---|---|---|---|
3.8 | 334. | PHPMS | Meot-Ner (Mautner), 1984 | gas phase; Entropy change calculated or estimated |
(C2H5O2+ • 4) +
= (C2H5O2+ • 5
)
By formula: (C2H5O2+ • 4H2O) + H2O = (C2H5O2+ • 5H2O)
Bond type: Hydrogen bond (positive ion to hydride)
Quantity | Value | Units | Method | Reference | Comment |
---|---|---|---|---|---|
ΔrH° | 10.3 | kcal/mol | PHPMS | Meot-Ner (Mautner), 1984 | gas phase; Entropy change calculated or estimated |
Quantity | Value | Units | Method | Reference | Comment |
ΔrS° | 21.2 | cal/mol*K | N/A | Meot-Ner (Mautner), 1984 | gas phase; Entropy change calculated or estimated |
Free energy of reaction
ΔrG° (kcal/mol) | T (K) | Method | Reference | Comment |
---|---|---|---|---|
4.1 | 280. | PHPMS | Meot-Ner (Mautner), 1984 | gas phase; Entropy change calculated or estimated |

Reaction thermochemistry data

Data compiled by: Michael M. Meot-Ner (Mautner) and Sharon G. Lias

Individual Reactions

(C2H5O2+ • 3Water) + Water = (C2H5O2+ • 4Water)

By formula: (C2H5O2+ • 3H2O) + H2O = (C2H5O2+ • 4H2O)

Bond type: Hydrogen bond (positive ion to hydride)

Quantity Value Units Method Reference Comment
Δr11.0kcal/molPHPMSMeot-Ner (Mautner), 1984gas phase; Entropy change calculated or estimated
Quantity Value Units Method Reference Comment
Δr21.6cal/mol*KN/AMeot-Ner (Mautner), 1984gas phase; Entropy change calculated or estimated

Free energy of reaction

ΔrG° (kcal/mol) T (K) Method Reference Comment
3.8334.PHPMSMeot-Ner (Mautner), 1984gas phase; Entropy change calculated or estimated

(C2H5O2+ • 4Water) + Water = (C2H5O2+ • 5Water)

By formula: (C2H5O2+ • 4H2O) + H2O = (C2H5O2+ • 5H2O)

Bond type: Hydrogen bond (positive ion to hydride)

Quantity Value Units Method Reference Comment
Δr10.3kcal/molPHPMSMeot-Ner (Mautner), 1984gas phase; Entropy change calculated or estimated
Quantity Value Units Method Reference Comment
Δr21.2cal/mol*KN/AMeot-Ner (Mautner), 1984gas phase; Entropy change calculated or estimated

Free energy of reaction

ΔrG° (kcal/mol) T (K) Method Reference Comment
4.1280.PHPMSMeot-Ner (Mautner), 1984gas phase; Entropy change calculated or estimated

(C2H5O2+ • 2Water) + Water = (C2H5O2+ • 3Water)

By formula: (C2H5O2+ • 2H2O) + H2O = (C2H5O2+ • 3H2O)

Bond type: Hydrogen bond (positive ion to hydride)

Quantity Value Units Method Reference Comment
Δr13.6kcal/molPHPMSMeot-Ner (Mautner), 1984gas phase
Quantity Value Units Method Reference Comment
Δr21.4cal/mol*KPHPMSMeot-Ner (Mautner), 1984gas phase

(C2H5O2+ • Water) + Water = (C2H5O2+ • 2Water)

By formula: (C2H5O2+ • H2O) + H2O = (C2H5O2+ • 2H2O)

Bond type: Hydrogen bond (positive ion to hydride)

Quantity Value Units Method Reference Comment
Δr16.2kcal/molPHPMSMeot-Ner (Mautner), 1984gas phase
Quantity Value Units Method Reference Comment
Δr26.5cal/mol*KPHPMSMeot-Ner (Mautner), 1984gas phase

C2H5O2+ + Water = (C2H5O2+ • Water)

By formula: C2H5O2+ + H2O = (C2H5O2+ • H2O)

Bond type: Hydrogen bond (positive ion to hydride)

Quantity Value Units Method Reference Comment
Δr21.5kcal/molPHPMSMeot-Ner (Mautner), 1984gas phase
Quantity Value Units Method Reference Comment
Δr25.0cal/mol*KPHPMSMeot-Ner (Mautner), 1984gas phase

References

Meot-Ner (Mautner), 1984
Meot-Ner (Mautner), M.,
The Ionic Hydrogen Bond and Ion Solvation. 2. Hydration of Onium Ions by 1 - 7 H2O Molecules. Relations Between Monomolecular, Specific and Bulk Hydration,
J. Am. Chem. Soc., 1984, 106, 5, 1265, https://doi.org/10.1021/ja00317a016
. [all data]