2,2,2-Trifluoroethylamine, protonated
- Formula: C2H5F3N+
- Molecular weight: 100.0625

Ion clustering data

Data compiled by: Michael M. Meot-Ner (Mautner) and Sharon G. Lias
Clustering reactions
By formula: C2H5F3N+ + H2O = (C2H5F3N+ • H2O)
Bond type: Hydrogen bond (positive ion to hydride)
Quantity | Value | Units | Method | Reference | Comment |
---|---|---|---|---|---|
ΔrH° | 88.3 | kJ/mol | PHPMS | Lau and Kebarle, 1981 | gas phase |
Quantity | Value | Units | Method | Reference | Comment |
ΔrS° | 126. | J/mol*K | PHPMS | Lau and Kebarle, 1981 | gas phase |
(C2H5F3N+ • ) +
= (C2H5F3N+ • 2
)
By formula: (C2H5F3N+ • H2O) + H2O = (C2H5F3N+ • 2H2O)
Bond type: Hydrogen bond (positive ion to hydride)
Quantity | Value | Units | Method | Reference | Comment |
---|---|---|---|---|---|
ΔrH° | 72.4 | kJ/mol | PHPMS | Lau and Kebarle, 1981 | gas phase |
Quantity | Value | Units | Method | Reference | Comment |
ΔrS° | 125. | J/mol*K | PHPMS | Lau and Kebarle, 1981 | gas phase |
(C2H5F3N+ • 2) +
= (C2H5F3N+ • 3
)
By formula: (C2H5F3N+ • 2H2O) + H2O = (C2H5F3N+ • 3H2O)
Bond type: Hydrogen bond (positive ion to hydride)
Quantity | Value | Units | Method | Reference | Comment |
---|---|---|---|---|---|
ΔrH° | 59.4 | kJ/mol | PHPMS | Lau and Kebarle, 1981 | gas phase |
Quantity | Value | Units | Method | Reference | Comment |
ΔrS° | 122. | J/mol*K | PHPMS | Lau and Kebarle, 1981 | gas phase |

References

Lau and Kebarle, 1981
Lau, Y.K.; Kebarle, P.,
Hydrogen Bonding Solvent Effect on the Basicity of Primary Amines CH3NH2, C2H5NH2, AND CF3CH2NH2,
Can. J. Chem., 1981, 59, 1, 151, https://doi.org/10.1139/v81-024
. [all data]