4-Octylaniline, protonated
- Formula: C14H24N+
- Molecular weight: 206.3465

Reaction thermochemistry data

Data compiled by: Michael M. Meot-Ner (Mautner) and Sharon G. Lias
Individual Reactions
By formula: C14H24N+ + C14H23N = (C14H24N+ • C14H23N)
Free energy of reaction
ΔrG° (kJ/mol) | T (K) | Method | Reference | Comment |
---|---|---|---|---|
46.9 | 500. | PHPMS | Sunner, Kulatunga, et al., 1986 | gas phase |

Ion clustering data

Data compiled by: Michael M. Meot-Ner (Mautner) and Sharon G. Lias
Clustering reactions
By formula: C14H24N+ + C14H23N = (C14H24N+ • C14H23N)
Free energy of reaction
ΔrG° (kJ/mol) | T (K) | Method | Reference | Comment |
---|---|---|---|---|
46.9 | 500. | PHPMS | Sunner, Kulatunga, et al., 1986 | gas phase |

References

Sunner, Kulatunga, et al., 1986
Sunner, J.A.; Kulatunga, R.; Kebarle, P.,
Fast Atom Bombardment Mass Spectrometry and Gas Phase Basicities,
Anal. Chem., 1986, 58, 7, 1312, https://doi.org/10.1021/ac00298a010
. [all data]