1,5-Naphthalenedisulfonic acid, di(conjugate base)
- Formula: C10H6O6S2-2
- Molecular weight: 286.282

Reaction thermochemistry data

Data compiled by: Michael M. Meot-Ner (Mautner) and Sharon G. Lias
Individual Reactions
(C10H6O6S2-2 • 2) +
= (C10H6O6S2-2 • 3
)
By formula: (C10H6O6S2-2 • 2H2O) + H2O = (C10H6O6S2-2 • 3H2O)
Bond type: Hydrogen bond (negative ion to hydride)
Quantity | Value | Units | Method | Reference | Comment |
---|---|---|---|---|---|
ΔrG° | 26. | kJ/mol | ES/HPMS | Blades, Klassen, et al., 1995 | gas phase |
(C10H6O6S2-2 • 3) +
= (C10H6O6S2-2 • 4
)
By formula: (C10H6O6S2-2 • 3H2O) + H2O = (C10H6O6S2-2 • 4H2O)
Bond type: Hydrogen bond (negative ion to hydride)
Quantity | Value | Units | Method | Reference | Comment |
---|---|---|---|---|---|
ΔrG° | 23. | kJ/mol | ES/HPMS | Blades, Klassen, et al., 1995 | gas phase |
(C10H6O6S2-2 • ) +
= (C10H6O6S2-2 • 2
)
By formula: (C10H6O6S2-2 • H2O) + H2O = (C10H6O6S2-2 • 2H2O)
Bond type: Hydrogen bond (negative ion to hydride)
Quantity | Value | Units | Method | Reference | Comment |
---|---|---|---|---|---|
ΔrG° | 29. | kJ/mol | ES/HPMS | Blades, Klassen, et al., 1995 | gas phase |
C10H6O6S2-2 + = (C10H6O6S2-2 •
)
By formula: C10H6O6S2-2 + H2O = (C10H6O6S2-2 • H2O)
Bond type: Hydrogen bond (negative ion to hydride)
Quantity | Value | Units | Method | Reference | Comment |
---|---|---|---|---|---|
ΔrG° | 33. | kJ/mol | ES/HPMS | Blades, Klassen, et al., 1995 | gas phase |

Ion clustering data

Data compiled by: Michael M. Meot-Ner (Mautner) and Sharon G. Lias
Clustering reactions
C10H6O6S2-2 + = (C10H6O6S2-2 •
)
By formula: C10H6O6S2-2 + H2O = (C10H6O6S2-2 • H2O)
Bond type: Hydrogen bond (negative ion to hydride)
Quantity | Value | Units | Method | Reference | Comment |
---|---|---|---|---|---|
ΔrG° | 33. | kJ/mol | ES/HPMS | Blades, Klassen, et al., 1995 | gas phase |
(C10H6O6S2-2 • ) +
= (C10H6O6S2-2 • 2
)
By formula: (C10H6O6S2-2 • H2O) + H2O = (C10H6O6S2-2 • 2H2O)
Bond type: Hydrogen bond (negative ion to hydride)
Quantity | Value | Units | Method | Reference | Comment |
---|---|---|---|---|---|
ΔrG° | 29. | kJ/mol | ES/HPMS | Blades, Klassen, et al., 1995 | gas phase |
(C10H6O6S2-2 • 2) +
= (C10H6O6S2-2 • 3
)
By formula: (C10H6O6S2-2 • 2H2O) + H2O = (C10H6O6S2-2 • 3H2O)
Bond type: Hydrogen bond (negative ion to hydride)
Quantity | Value | Units | Method | Reference | Comment |
---|---|---|---|---|---|
ΔrG° | 26. | kJ/mol | ES/HPMS | Blades, Klassen, et al., 1995 | gas phase |
(C10H6O6S2-2 • 3) +
= (C10H6O6S2-2 • 4
)
By formula: (C10H6O6S2-2 • 3H2O) + H2O = (C10H6O6S2-2 • 4H2O)
Bond type: Hydrogen bond (negative ion to hydride)
Quantity | Value | Units | Method | Reference | Comment |
---|---|---|---|---|---|
ΔrG° | 23. | kJ/mol | ES/HPMS | Blades, Klassen, et al., 1995 | gas phase |

References

Blades, Klassen, et al., 1995
Blades, A.T.; Klassen, J.S.; Kebarle, P.,
Free Energies of Hydration in the Gas Phase on the Anions of Some Oxo Acids of C, N, S, P, Cl and I,
J. Am. Chem. Soc., 1995, 117, 42, 10563, https://doi.org/10.1021/ja00147a019
. [all data]