1,10-Diaminodecane, diprotonated
- Formula: C10H26N2+2
- Molecular weight: 174.3257

Ion clustering data

Data compiled by: Michael M. Meot-Ner (Mautner) and Sharon G. Lias
Clustering reactions
C10H26N2+2 + = (C10H26N2+2 •
)
By formula: C10H26N2+2 + H2O = (C10H26N2+2 • H2O)
Bond type: Hydrogen bond (positive ion to hydride)
Quantity | Value | Units | Method | Reference | Comment |
---|---|---|---|---|---|
ΔrH° | 70.3 | kJ/mol | ES/HPMS | Blades, Klassen, et al., 1996 | gas phase |
Quantity | Value | Units | Method | Reference | Comment |
ΔrS° | 95.4 | J/mol*K | ES/HPMS | Blades, Klassen, et al., 1996 | gas phase |
Quantity | Value | Units | Method | Reference | Comment |
ΔrG° | 43.1 | kJ/mol | ES/HPMS | Blades, Klassen, et al., 1996 | gas phase |
(C10H26N2+2 • ) +
= (C10H26N2+2 • 2
)
By formula: (C10H26N2+2 • H2O) + H2O = (C10H26N2+2 • 2H2O)
Bond type: Hydrogen bond (positive ion to hydride)
Quantity | Value | Units | Method | Reference | Comment |
---|---|---|---|---|---|
ΔrH° | 70.3 | kJ/mol | ES/HPMS | Blades, Klassen, et al., 1996 | gas phase |
Quantity | Value | Units | Method | Reference | Comment |
ΔrS° | 105. | J/mol*K | ES/HPMS | Blades, Klassen, et al., 1996 | gas phase |
Quantity | Value | Units | Method | Reference | Comment |
ΔrG° | 39. | kJ/mol | ES/HPMS | Blades, Klassen, et al., 1996 | gas phase |
(C10H26N2+2 • 2) +
= (C10H26N2+2 • 3
)
By formula: (C10H26N2+2 • 2H2O) + H2O = (C10H26N2+2 • 3H2O)
Bond type: Hydrogen bond (positive ion to hydride)
Free energy of reaction
ΔrG° (kJ/mol) | T (K) | Method | Reference | Comment |
---|---|---|---|---|
31. | 293. | ES/HPMS | Klassen, Blades, et al., 1995 | gas phase |
(C10H26N2+2 • 3) +
= (C10H26N2+2 • 4
)
By formula: (C10H26N2+2 • 3H2O) + H2O = (C10H26N2+2 • 4H2O)
Bond type: Hydrogen bond (positive ion to hydride)
Free energy of reaction
ΔrG° (kJ/mol) | T (K) | Method | Reference | Comment |
---|---|---|---|---|
28. | 293. | ES/HPMS | Klassen, Blades, et al., 1995 | gas phase |
(C10H26N2+2 • 4) +
= (C10H26N2+2 • 5
)
By formula: (C10H26N2+2 • 4H2O) + H2O = (C10H26N2+2 • 5H2O)
Bond type: Hydrogen bond (positive ion to hydride)
Free energy of reaction
ΔrG° (kJ/mol) | T (K) | Method | Reference | Comment |
---|---|---|---|---|
24. | 293. | ES/HPMS | Klassen, Blades, et al., 1995 | gas phase |
(C10H26N2+2 • 5) +
= (C10H26N2+2 • 6
)
By formula: (C10H26N2+2 • 5H2O) + H2O = (C10H26N2+2 • 6H2O)
Bond type: Hydrogen bond (positive ion to hydride)
Free energy of reaction
ΔrG° (kJ/mol) | T (K) | Method | Reference | Comment |
---|---|---|---|---|
21. | 293. | ES/HPMS | Klassen, Blades, et al., 1995 | gas phase |

References

Blades, Klassen, et al., 1996
Blades, A.T.; Klassen, J.S.; Kebarle, P.,
Determination of Ion-Solvent Equilibria in the Gas Phase. Hydration of Diprotonated Diamines and Bis(trimethylammonium) Alkanes,
J. Am. Chem. Soc., 1996, 118, 49, 12437, https://doi.org/10.1021/ja962641t
. [all data]
Klassen, Blades, et al., 1995
Klassen, J.S.; Blades, A.T.; Kebarle, P.,
Determinations of Ion-Molecule Equilibria Involving Ions Produced by Electrospray. Hydration of Protonated Amines, Diamines, and Some Small Peptides,
J. Phys. Chem., 1995, 99, 42, 15509, https://doi.org/10.1021/j100042a027
. [all data]