Decanedioic acid, di(conjugate base)
- Formula: C10H16O4-2
- Molecular weight: 200.2327

Reaction thermochemistry data

Data compiled by: Michael M. Meot-Ner (Mautner) and Sharon G. Lias
Individual Reactions
(C10H16O4-2 • 2) +
= (C10H16O4-2 • 3
)
By formula: (C10H16O4-2 • 2H2O) + H2O = (C10H16O4-2 • 3H2O)
Bond type: Hydrogen bond (negative ion to hydride)
Quantity | Value | Units | Method | Reference | Comment |
---|---|---|---|---|---|
ΔrG° | 31. | kJ/mol | ES/HPMS | Blades, Klassen, et al., 1995 | gas phase |
(C10H16O4-2 • 3) +
= (C10H16O4-2 • 4
)
By formula: (C10H16O4-2 • 3H2O) + H2O = (C10H16O4-2 • 4H2O)
Bond type: Hydrogen bond (negative ion to hydride)
Quantity | Value | Units | Method | Reference | Comment |
---|---|---|---|---|---|
ΔrG° | 28. | kJ/mol | ES/HPMS | Blades, Klassen, et al., 1995 | gas phase |
(C10H16O4-2 • 4) +
= (C10H16O4-2 • 5
)
By formula: (C10H16O4-2 • 4H2O) + H2O = (C10H16O4-2 • 5H2O)
Bond type: Hydrogen bond (negative ion to hydride)
Quantity | Value | Units | Method | Reference | Comment |
---|---|---|---|---|---|
ΔrG° | 24. | kJ/mol | ES/HPMS | Blades, Klassen, et al., 1995 | gas phase |
(C10H16O4-2 • 5) +
= (C10H16O4-2 • 6
)
By formula: (C10H16O4-2 • 5H2O) + H2O = (C10H16O4-2 • 6H2O)
Bond type: Hydrogen bond (negative ion to hydride)
Quantity | Value | Units | Method | Reference | Comment |
---|---|---|---|---|---|
ΔrG° | 21. | kJ/mol | ES/HPMS | Blades, Klassen, et al., 1995 | gas phase |

Ion clustering data

Data compiled by: Michael M. Meot-Ner (Mautner) and Sharon G. Lias
Clustering reactions
(C10H16O4-2 • 2) +
= (C10H16O4-2 • 3
)
By formula: (C10H16O4-2 • 2H2O) + H2O = (C10H16O4-2 • 3H2O)
Bond type: Hydrogen bond (negative ion to hydride)
Quantity | Value | Units | Method | Reference | Comment |
---|---|---|---|---|---|
ΔrG° | 31. | kJ/mol | ES/HPMS | Blades, Klassen, et al., 1995 | gas phase |
(C10H16O4-2 • 3) +
= (C10H16O4-2 • 4
)
By formula: (C10H16O4-2 • 3H2O) + H2O = (C10H16O4-2 • 4H2O)
Bond type: Hydrogen bond (negative ion to hydride)
Quantity | Value | Units | Method | Reference | Comment |
---|---|---|---|---|---|
ΔrG° | 28. | kJ/mol | ES/HPMS | Blades, Klassen, et al., 1995 | gas phase |
(C10H16O4-2 • 4) +
= (C10H16O4-2 • 5
)
By formula: (C10H16O4-2 • 4H2O) + H2O = (C10H16O4-2 • 5H2O)
Bond type: Hydrogen bond (negative ion to hydride)
Quantity | Value | Units | Method | Reference | Comment |
---|---|---|---|---|---|
ΔrG° | 24. | kJ/mol | ES/HPMS | Blades, Klassen, et al., 1995 | gas phase |
(C10H16O4-2 • 5) +
= (C10H16O4-2 • 6
)
By formula: (C10H16O4-2 • 5H2O) + H2O = (C10H16O4-2 • 6H2O)
Bond type: Hydrogen bond (negative ion to hydride)
Quantity | Value | Units | Method | Reference | Comment |
---|---|---|---|---|---|
ΔrG° | 21. | kJ/mol | ES/HPMS | Blades, Klassen, et al., 1995 | gas phase |

References

Blades, Klassen, et al., 1995
Blades, A.T.; Klassen, J.S.; Kebarle, P.,
Free Energies of Hydration in the Gas Phase on the Anions of Some Oxo Acids of C, N, S, P, Cl and I,
J. Am. Chem. Soc., 1995, 117, 42, 10563, https://doi.org/10.1021/ja00147a019
. [all data]