Ferrocene, protonated

Reaction thermochemistry data

Data compiled by: Michael M. Meot-Ner (Mautner) and Sharon G. Lias

Individual Reactions

C10H11Fe+ + Acetonitrile = (C10H11Fe+ • Acetonitrile)

By formula: C10H11Fe+ + C2H3N = (C10H11Fe+ • C2H3N)

Quantity Value Units Method Reference Comment
Δr54.0kJ/molPHPMSMeot-Ner (Mautner), 1989gas phase
Quantity Value Units Method Reference Comment
Δr97.9J/mol*KPHPMSMeot-Ner (Mautner), 1989gas phase

References

Meot-Ner (Mautner), 1989
Meot-Ner (Mautner), M., Ion DChemistry of Ferrocene. Thermochemistry of Ionization and Protonation and Solvent Clustering. Slow and Entropy - Driven Proton - Transfer Kinetics, J. Am. Chem. Soc., 1989, 111, 8, 2830, https://doi.org/10.1021/ja00190a014 . [all data]