SiF4..pNO2-nitrobenzene radical anion
- Formula: C6H4F4N2O4Si-
- Molecular weight: 272.1866

Gas phase thermochemistry data

Data compiled by: John E. Bartmess
Quantity | Value | Units | Method | Reference | Comment |
---|---|---|---|---|---|
ΔfH°gas | -439.5 ± 2.6 | kcal/mol | Ther | Williamson, Knighton, et al., 2001 | at 150 C |

Reaction thermochemistry data

Data compiled by: John E. Bartmess
Individual Reactions
C6H4N2O4- + = C6H4F4N2O4Si-
By formula: C6H4N2O4- + F4Si = C6H4F4N2O4Si-
Quantity | Value | Units | Method | Reference | Comment |
---|---|---|---|---|---|
ΔrH° | 21.0 ± 1.0 | kcal/mol | TDAs | Williamson, Knighton, et al., 2001 | gas phase; at 150 C |
Quantity | Value | Units | Method | Reference | Comment |
ΔrG° | 4.20 ± 0.60 | kcal/mol | TDAs | Williamson, Knighton, et al., 2001 | gas phase; at 150 C |

Ion clustering data

Data compiled by: John E. Bartmess
Clustering reactions
C6H4N2O4- + = C6H4F4N2O4Si-
By formula: C6H4N2O4- + F4Si = C6H4F4N2O4Si-
Quantity | Value | Units | Method | Reference | Comment |
---|---|---|---|---|---|
ΔrH° | 21.0 ± 1.0 | kcal/mol | TDAs | Williamson, Knighton, et al., 2001 | gas phase; at 150 C |
Quantity | Value | Units | Method | Reference | Comment |
ΔrG° | 4.20 ± 0.60 | kcal/mol | TDAs | Williamson, Knighton, et al., 2001 | gas phase; at 150 C |

References

Williamson, Knighton, et al., 2001
Williamson, D.H.; Knighton, W.B.; Grimsrud, E.P.,
Lewis acid-base interactions of SiF4 with molecular anions formed by electron capture reactions,
Int. J. Mass Spectrom., 2001, 206, 1-2, 53-61, https://doi.org/10.1016/S1387-3806(00)00388-2
. [all data]