SiF4..benzophenone radical anion
- Formula: C13H10F4OSi-
- Molecular weight: 286.2976

Reaction thermochemistry data

Data compiled by: John E. Bartmess
Individual Reactions
C13H10O- + = C13H10F4OSi-
By formula: C13H10O- + F4Si = C13H10F4OSi-
Quantity | Value | Units | Method | Reference | Comment |
---|---|---|---|---|---|
ΔrG° | 22.00 ± 0.60 | kcal/mol | IMRE | Williamson, Knighton, et al., 2001 | gas phase; at 150 C |

Ion clustering data

Data compiled by: John E. Bartmess
Clustering reactions
C13H10O- + = C13H10F4OSi-
By formula: C13H10O- + F4Si = C13H10F4OSi-
Quantity | Value | Units | Method | Reference | Comment |
---|---|---|---|---|---|
ΔrG° | 22.00 ± 0.60 | kcal/mol | IMRE | Williamson, Knighton, et al., 2001 | gas phase; at 150 C |

References

Williamson, Knighton, et al., 2001
Williamson, D.H.; Knighton, W.B.; Grimsrud, E.P.,
Lewis acid-base interactions of SiF4 with molecular anions formed by electron capture reactions,
Int. J. Mass Spectrom., 2001, 206, 1-2, 53-61, https://doi.org/10.1016/S1387-3806(00)00388-2
. [all data]