SiF4..pBr-nitrobenzene radical anion
- Formula: C6H4BrF4NO2Si-
- Molecular weight: 306.085

Reaction thermochemistry data

Data compiled by: John E. Bartmess
Individual Reactions
C6H4BrNO2- + = C6H4BrF4NO2Si-
By formula: C6H4BrNO2- + F4Si = C6H4BrF4NO2Si-
Quantity | Value | Units | Method | Reference | Comment |
---|---|---|---|---|---|
ΔrG° | 11.70 ± 0.60 | kcal/mol | IMRE | Williamson, Knighton, et al., 2001 | gas phase; at 150 C |

Ion clustering data

Data compiled by: John E. Bartmess
Clustering reactions
C6H4BrNO2- + = C6H4BrF4NO2Si-
By formula: C6H4BrNO2- + F4Si = C6H4BrF4NO2Si-
Quantity | Value | Units | Method | Reference | Comment |
---|---|---|---|---|---|
ΔrG° | 11.70 ± 0.60 | kcal/mol | IMRE | Williamson, Knighton, et al., 2001 | gas phase; at 150 C |

References

Williamson, Knighton, et al., 2001
Williamson, D.H.; Knighton, W.B.; Grimsrud, E.P.,
Lewis acid-base interactions of SiF4 with molecular anions formed by electron capture reactions,
Int. J. Mass Spectrom., 2001, 206, 1-2, 53-61, https://doi.org/10.1016/S1387-3806(00)00388-2
. [all data]