HCCH..Br anion
- Formula: C2H2Br-
- Molecular weight: 105.942

Gas phase thermochemistry data

Data compiled by: John E. Bartmess
Quantity | Value | Units | Method | Reference | Comment |
---|---|---|---|---|---|
ΔfH°gas | -4.89 | kcal/mol | Ther | Wild, Milley, et al., 2000 | Given: 8.635±0.009 kcal/mol(0 K) |

Ion clustering data

Data compiled by: John E. Bartmess
Clustering reactions
By formula: Br- + C2H2 = C2H2Br-
Quantity | Value | Units | Method | Reference | Comment |
---|---|---|---|---|---|
ΔrH° | 8.60 | kcal/mol | LPES | Wild, Milley, et al., 2000 | gas phase; Given: 8.635±0.009 kcal/mol(0 K) |

Reaction thermochemistry data

Data compiled by: John E. Bartmess

Individual Reactions

Bromine anion + Acetylene = C2H2Br-

By formula: Br- + C2H2 = C2H2Br-

Quantity Value Units Method Reference Comment
Δr36.0kJ/molLPESWild, Milley, et al., 2000gas phase; Given: 8.635±0.009 kcal/mol(0 K)

References

Wild, Milley, et al., 2000
Wild, D.A.; Milley, P.J.; Loh, Z.M.; Wolynec, P.P.; Weiser, P.S.; Bieske, E.J.,
Structural and Energetic Properties of the Br--C2H2 Anion Complex from Rotationally Resolved Mid-infrared Spectra And ab initio Calculations,
J. Chem. Phys., 2000, 113, 3, 1075, https://doi.org/10.1063/1.481919
. [all data]