MeOH..pMe-C6H4CðC anion
- Formula: C10H11O-
- Molecular weight: 147.1943

Reaction thermochemistry data

Data compiled by: John E. Bartmess
Individual Reactions
C9H7- + = C10H11O-
By formula: C9H7- + CH4O = C10H11O-
Quantity | Value | Units | Method | Reference | Comment |
---|---|---|---|---|---|
ΔrH° | 90.4 ± 8.4 | kJ/mol | IMRE | Chabinyc and Brauman, 1999 | gas phase; Anchored to MeOH ΔGacid=375.2 |
Quantity | Value | Units | Method | Reference | Comment |
ΔrG° | 42.68 | kJ/mol | IMRE | Mustanir, Matsuoka, et al., 2006 | gas phase |
ΔrG° | 46.4 ± 8.4 | kJ/mol | IMRE | Chabinyc and Brauman, 1999 | gas phase; Anchored to MeOH ΔGacid=375.2 |

Ion clustering data

Data compiled by: John E. Bartmess
Clustering reactions
C9H7- + = C10H11O-
By formula: C9H7- + CH4O = C10H11O-
Quantity | Value | Units | Method | Reference | Comment |
---|---|---|---|---|---|
ΔrH° | 90.4 ± 8.4 | kJ/mol | IMRE | Chabinyc and Brauman, 1999 | gas phase; Anchored to MeOH ΔGacid=375.2 |
Quantity | Value | Units | Method | Reference | Comment |
ΔrG° | 42.68 | kJ/mol | IMRE | Mustanir, Matsuoka, et al., 2006 | gas phase |
ΔrG° | 46.4 ± 8.4 | kJ/mol | IMRE | Chabinyc and Brauman, 1999 | gas phase; Anchored to MeOH ΔGacid=375.2 |

Gas phase thermochemistry data

Data compiled by: John E. Bartmess
Quantity | Value | Units | Method | Reference | Comment |
---|---|---|---|---|---|
ΔfH°gas | 2.2 ± 3.2 | kcal/mol | Ther | Chabinyc and Brauman, 1999 | Anchored to MeOH ΔGacid=375.2 |

References

Chabinyc and Brauman, 1999
Chabinyc, M.L.; Brauman, J.I.,
Hydrogen bond strength and acidity. Structural and energetic correlations for acetylides and alcohols,
J. Phys. Chem. A, 1999, 103, 46, 9163-9166, https://doi.org/10.1021/jp992852v
. [all data]
Mustanir, Matsuoka, et al., 2006
Mustanir; Matsuoka, M.; Mishima, M.; Koch, H.,
Stability of complexes of phenylacetylides and benzyl alkoxides with methanol in the gas phase. Acid-base correlation in the ionic hydrogen-bond strength,
Bull. Chem. Soc. Japan, 2006, 79, 7, 1118-1125, https://doi.org/10.1246/bcsj.79.1118
. [all data]