CH2=CHCHBr anion

Reaction thermochemistry data

Data compiled by: John E. Bartmess

Individual Reactions

C3H4Br- + Hydrogen cation = 1-Propene, 3-bromo-

By formula: C3H4Br- + H+ = C3H5Br

Quantity Value Units Method Reference Comment
Δr1570. ± 8.8kJ/molG+TSPoutsma, Nash, et al., 1997gas phase; Between iPrOH, HF; near tBuOH
Quantity Value Units Method Reference Comment
Δr1540. ± 8.4kJ/molIMRBPoutsma, Nash, et al., 1997gas phase; Between iPrOH, HF; near tBuOH

Gas phase ion energetics data

Data compiled by: John E. Bartmess

Protonation reactions

C3H4Br- + Hydrogen cation = 1-Propene, 3-bromo-

By formula: C3H4Br- + H+ = C3H5Br

Quantity Value Units Method Reference Comment
Δr375.3 ± 2.1kcal/molG+TSPoutsma, Nash, et al., 1997gas phase; Between iPrOH, HF; near tBuOH
Quantity Value Units Method Reference Comment
Δr368.0 ± 2.0kcal/molIMRBPoutsma, Nash, et al., 1997gas phase; Between iPrOH, HF; near tBuOH

References

Poutsma, Nash, et al., 1997
Poutsma, J.C.; Nash, J.J.; Paulino, J.A.; Squires, R.R., Absolute Heats of Formation of Phenylcarbene and Vinylcarbene, J. Am. Chem. Soc., 1997, 119, 20, 4686, https://doi.org/10.1021/ja963918s . [all data]