(EtOH)3..Br anion
- Formula: C6H18BrO3-
- Molecular weight: 218.110

Ion clustering data

Data compiled by: John E. Bartmess
Clustering reactions
By formula: Br- + 3C2H6O = C6H18BrO3-
Quantity | Value | Units | Method | Reference | Comment |
---|---|---|---|---|---|
ΔrH° | 9.50 ± 0.30 | kcal/mol | TDAs | Bogdanov, Peschke, et al., 1999 | gas phase |
Quantity | Value | Units | Method | Reference | Comment |
ΔrG° | 4.37 | kcal/mol | TDAs | Bogdanov, Peschke, et al., 1999 | gas phase |

References

Bogdanov, Peschke, et al., 1999
Bogdanov, B.; Peschke, M.; Tonner, D.S.; Szulejko, J.E.; McMahon, T.B.,
Stepwise solvation of halides by alcohol molecules in the gas phase,
Int. J. Mass Spectrom., 1999, 187, 707-725, https://doi.org/10.1016/S1387-3806(98)14180-5
. [all data]