(EtOH)3..F anion
- Formula: C6H18FO3-
- Molecular weight: 157.2043

Reaction thermochemistry data

Data compiled by: John E. Bartmess
Individual Reactions
C4H12FO2- + 3 = C6H18FO3-
By formula: C4H12FO2- + 3C2H6O = C6H18FO3-
Quantity | Value | Units | Method | Reference | Comment |
---|---|---|---|---|---|
ΔrH° | 15.60 ± 0.10 | kcal/mol | TDAs | Bogdanov, Peschke, et al., 1999 | gas phase |
Quantity | Value | Units | Method | Reference | Comment |
ΔrG° | 8.12 | kcal/mol | TDAs | Bogdanov, Peschke, et al., 1999 | gas phase |

Ion clustering data

Data compiled by: John E. Bartmess
Clustering reactions
C4H12FO2- + 3 = C6H18FO3-
By formula: C4H12FO2- + 3C2H6O = C6H18FO3-
Quantity | Value | Units | Method | Reference | Comment |
---|---|---|---|---|---|
ΔrH° | 15.60 ± 0.10 | kcal/mol | TDAs | Bogdanov, Peschke, et al., 1999 | gas phase |
Quantity | Value | Units | Method | Reference | Comment |
ΔrG° | 8.12 | kcal/mol | TDAs | Bogdanov, Peschke, et al., 1999 | gas phase |

Gas phase thermochemistry data

Data compiled by: John E. Bartmess

Quantity Value Units Method Reference Comment
Δfgas-1241.4 ± 3.3kJ/molTherBogdanov, Peschke, et al., 1999

References

Bogdanov, Peschke, et al., 1999
Bogdanov, B.; Peschke, M.; Tonner, D.S.; Szulejko, J.E.; McMahon, T.B.,
Stepwise solvation of halides by alcohol molecules in the gas phase,
Int. J. Mass Spectrom., 1999, 187, 707-725, https://doi.org/10.1016/S1387-3806(98)14180-5
. [all data]