(EtOH)2..F anion
- Formula: C4H12FO2-
- Molecular weight: 111.1358

Gas phase thermochemistry data

Data compiled by: John E. Bartmess
Quantity | Value | Units | Method | Reference | Comment |
---|---|---|---|---|---|
ΔfH°gas | -940.9 ± 3.3 | kJ/mol | Ther | Bogdanov, Peschke, et al., 1999 |

Ion clustering data

Data compiled by: John E. Bartmess
Clustering reactions
C2H6FO- + 2 = C4H12FO2-
By formula: C2H6FO- + 2C2H6O = C4H12FO2-
Quantity | Value | Units | Method | Reference | Comment |
---|---|---|---|---|---|
ΔrH° | 86.2 ± 1.3 | kJ/mol | TDAs | Bogdanov, Peschke, et al., 1999 | gas phase |
Quantity | Value | Units | Method | Reference | Comment |
ΔrG° | 50.63 | kJ/mol | TDAs | Bogdanov, Peschke, et al., 1999 | gas phase |
C4H12FO2- + 3 = C6H18FO3-
By formula: C4H12FO2- + 3C2H6O = C6H18FO3-
Quantity | Value | Units | Method | Reference | Comment |
---|---|---|---|---|---|
ΔrH° | 65.27 ± 0.42 | kJ/mol | TDAs | Bogdanov, Peschke, et al., 1999 | gas phase |
Quantity | Value | Units | Method | Reference | Comment |
ΔrG° | 34.0 | kJ/mol | TDAs | Bogdanov, Peschke, et al., 1999 | gas phase |

Reaction thermochemistry data

Data compiled by: John E. Bartmess
Individual Reactions
C2H6FO- + 2 = C4H12FO2-
By formula: C2H6FO- + 2C2H6O = C4H12FO2-
Quantity | Value | Units | Method | Reference | Comment |
---|---|---|---|---|---|
ΔrH° | 20.60 ± 0.30 | kcal/mol | TDAs | Bogdanov, Peschke, et al., 1999 | gas phase |
Quantity | Value | Units | Method | Reference | Comment |
ΔrG° | 12.10 | kcal/mol | TDAs | Bogdanov, Peschke, et al., 1999 | gas phase |
C4H12FO2- + 3 = C6H18FO3-
By formula: C4H12FO2- + 3C2H6O = C6H18FO3-
Quantity | Value | Units | Method | Reference | Comment |
---|---|---|---|---|---|
ΔrH° | 15.60 ± 0.10 | kcal/mol | TDAs | Bogdanov, Peschke, et al., 1999 | gas phase |
Quantity | Value | Units | Method | Reference | Comment |
ΔrG° | 8.12 | kcal/mol | TDAs | Bogdanov, Peschke, et al., 1999 | gas phase |

References

Bogdanov, Peschke, et al., 1999
Bogdanov, B.; Peschke, M.; Tonner, D.S.; Szulejko, J.E.; McMahon, T.B.,
Stepwise solvation of halides by alcohol molecules in the gas phase,
Int. J. Mass Spectrom., 1999, 187, 707-725, https://doi.org/10.1016/S1387-3806(98)14180-5
. [all data]