N-diazirinide anion
- Formula: CH3N2-
- Molecular weight: 43.0485
- IUPAC Standard InChIKey: WTNALQUPTJJNAV-UHFFFAOYSA-N
- Chemical structure:
View 3d structure (requires JavaScript / HTML 5) - Permanent link for this species. Use this link for bookmarking this species for future reference.

Reaction thermochemistry data

Data compiled by: John E. Bartmess
Individual Reactions
By formula: CH3N2- + H+ = CH2N2
Quantity | Value | Units | Method | Reference | Comment |
---|---|---|---|---|---|
ΔrH° | 1633. ± 13. | kJ/mol | G+TS | Broadus and Kass, 1999 | gas phase; Betweeen D2O, fluorobenzene |
Quantity | Value | Units | Method | Reference | Comment |
ΔrG° | 1598. ± 13. | kJ/mol | IMRB | Broadus and Kass, 1999 | gas phase; Betweeen D2O, fluorobenzene |

Gas phase ion energetics data

Data compiled by: John E. Bartmess
Electron affinity of neutral species
EAneutral (eV) | Method | Reference | Comment |
---|---|---|---|
0.50 ± 0.10 | IMRB | Broadus and Kass, 1999 |
Protonation reactions
By formula: CH3N2- + H+ = CH2N2
Quantity | Value | Units | Method | Reference | Comment |
---|---|---|---|---|---|
ΔrH° | 1633. ± 13. | kJ/mol | G+TS | Broadus and Kass, 1999 | gas phase; Betweeen D2O, fluorobenzene |
Quantity | Value | Units | Method | Reference | Comment |
ΔrG° | 1598. ± 13. | kJ/mol | IMRB | Broadus and Kass, 1999 | gas phase; Betweeen D2O, fluorobenzene |

References

Broadus and Kass, 1999
Broadus, K.M.; Kass, S.R.,
Conjugate Base of a Cyclic Hydrazine: Formation and Energetics of N-Diaziridyl Anion,
Int. J. Mass Spectrom., 1999, 185, 179, https://doi.org/10.1016/S1387-3806(98)14164-7
. [all data]