(HCO2H)2..I anion
- Formula: C2H4IO4-
- Molecular weight: 218.9558

Gas phase thermochemistry data

Data compiled by: John E. Bartmess
Quantity | Value | Units | Method | Reference | Comment |
---|---|---|---|---|---|
ΔfH°gas | -254.9 ± 2.3 | kcal/mol | Ther | Walker and Sunderlin, 1999 |

Ion clustering data

Data compiled by: John E. Bartmess
Clustering reactions
CH2IO2- + 2 = C2H4IO4-
By formula: CH2IO2- + 2CH2O2 = C2H4IO4-
Quantity | Value | Units | Method | Reference | Comment |
---|---|---|---|---|---|
ΔrH° | 10.0 ± 2.1 | kcal/mol | CIDT | Walker and Sunderlin, 1999 | gas phase |

References

Walker and Sunderlin, 1999
Walker, B.W.; Sunderlin, L.S.,
The thermochemistry of formic acid halide anion clusters,
Int. J. Mass Spectrom., 1999, 184, 2-3, 183-189, https://doi.org/10.1016/S1387-3806(99)00008-1
. [all data]