Co..cyclopentadienide anion
- Formula: C5H5Co-
- Molecular weight: 124.0269

Reaction thermochemistry data

Data compiled by: John E. Bartmess
Individual Reactions
By formula: C5H5- + Co = C5H5Co-
Quantity | Value | Units | Method | Reference | Comment |
---|---|---|---|---|---|
ΔrH° | 29.3 ± 2.5 | kJ/mol | N/A | Sunderlin and Squires, 1999 | gas phase |

Ion clustering data

Data compiled by: John E. Bartmess
Clustering reactions
By formula: C5H5- + Co = C5H5Co-
Quantity | Value | Units | Method | Reference | Comment |
---|---|---|---|---|---|
ΔrH° | 29.3 ± 2.5 | kJ/mol | N/A | Sunderlin and Squires, 1999 | gas phase |

Gas phase thermochemistry data

Data compiled by: John E. Bartmess

Quantity Value Units Method Reference Comment
Δfgas114.8 ± 2.4kcal/molTherSunderlin and Squires, 1999

References

Sunderlin and Squires, 1999
Sunderlin, L.S.; Squires, R.R.,
Bond strengths in cyclopentadienyl metal carbonyl anions,
Int. J. Mass Spectrom., 1999, 183, 149-161, https://doi.org/10.1016/S1387-3806(98)14230-6
. [all data]