COCo..Cp anion

Reaction thermochemistry data

Data compiled by: John E. Bartmess

Individual Reactions

cyclopentadienide anion + CCoO = C6H5CoO-

By formula: C5H5- + CCoO = C6H5CoO-

Quantity Value Units Method Reference Comment
Δr42.7 ± 3.3kJ/molN/ASunderlin and Squires, 1999gas phase

Ion clustering data

Data compiled by: John E. Bartmess

Clustering reactions

cyclopentadienide anion + CCoO = C6H5CoO-

By formula: C5H5- + CCoO = C6H5CoO-

Quantity Value Units Method Reference Comment
Δr10.20 ± 0.80kcal/molN/ASunderlin and Squires, 1999gas phase

References

Sunderlin and Squires, 1999
Sunderlin, L.S.; Squires, R.R., Bond strengths in cyclopentadienyl metal carbonyl anions, Int. J. Mass Spectrom., 1999, 183, 149-161, https://doi.org/10.1016/S1387-3806(98)14230-6 . [all data]