CO..CpMn anion
- Formula: C6H5MnO-
- Molecular weight: 148.0419

Reaction thermochemistry data

Data compiled by: John E. Bartmess
Individual Reactions
C6H5MnO- + = C6H5MnO-
By formula: C6H5MnO- + CO = C6H5MnO-
Quantity | Value | Units | Method | Reference | Comment |
---|---|---|---|---|---|
ΔrH° | 20.9 ± 2.1 | kJ/mol | N/A | Sunderlin and Squires, 1999 | gas phase |

Ion clustering data

Data compiled by: John E. Bartmess

Clustering reactions

C6H5MnO- + Carbon monoxide = C6H5MnO-

By formula: C6H5MnO- + CO = C6H5MnO-

Quantity Value Units Method Reference Comment
Δr20.9 ± 2.1kJ/molN/ASunderlin and Squires, 1999gas phase

References

Sunderlin and Squires, 1999
Sunderlin, L.S.; Squires, R.R.,
Bond strengths in cyclopentadienyl metal carbonyl anions,
Int. J. Mass Spectrom., 1999, 183, 149-161, https://doi.org/10.1016/S1387-3806(98)14230-6
. [all data]