(H2O)..{MeCO2H}..NO3 anion
- Formula: C2H6NO6-
- Molecular weight: 140.0727

Reaction thermochemistry data

Data compiled by: John E. Bartmess
Individual Reactions
C2H4NO5- + +
= C2H6NO6-
By formula: C2H4NO5- + H2O + C2H4O2 = C2H6NO6-
Quantity | Value | Units | Method | Reference | Comment |
---|---|---|---|---|---|
ΔrG° | 4.60 ± 0.20 | kcal/mol | IMRE | Viidanoja, Reiner, et al., 2000 | gas phase |

References

Viidanoja, Reiner, et al., 2000
Viidanoja, J.; Reiner, T.; Kiendler, A.; Grimm, F.; Arnold, F.,
Laboratory investigations of negative ion molecule reactions of propionic, butyric, glyoxylic, pyruvic, and pinonic acids,
Int. J. Mass Spectrom., 2000, 194, 1, 53-68, https://doi.org/10.1016/S1387-3806(99)00172-4
. [all data]