(H2O)..{HCO2H}..NO3 anion
- Formula: CH4NO6-
- Molecular weight: 126.0461

Ion clustering data

Data compiled by: John E. Bartmess
Clustering reactions
CH2NO5- + +
= CH4NO6-
By formula: CH2NO5- + H2O + CH2O2 = CH4NO6-
Quantity | Value | Units | Method | Reference | Comment |
---|---|---|---|---|---|
ΔrG° | 18.4 ± 0.84 | kJ/mol | IMRE | Viidanoja, Reiner, et al., 2000 | gas phase |

References

Viidanoja, Reiner, et al., 2000
Viidanoja, J.; Reiner, T.; Kiendler, A.; Grimm, F.; Arnold, F.,
Laboratory investigations of negative ion molecule reactions of propionic, butyric, glyoxylic, pyruvic, and pinonic acids,
Int. J. Mass Spectrom., 2000, 194, 1, 53-68, https://doi.org/10.1016/S1387-3806(99)00172-4
. [all data]