(H2O)..{MeCO2H}..CO3 radical anion
- Formula: C3H6O6-
- Molecular weight: 138.0767

Ion clustering data

Data compiled by: John E. Bartmess
Clustering reactions
C3H4O5- + +
= C3H6O6-
By formula: C3H4O5- + H2O + C2H4O2 = C3H6O6-
Quantity | Value | Units | Method | Reference | Comment |
---|---|---|---|---|---|
ΔrG° | 19.2 ± 0.84 | kJ/mol | IMRE | Viidanoja, Reiner, et al., 2000 | gas phase |

References

Viidanoja, Reiner, et al., 2000
Viidanoja, J.; Reiner, T.; Kiendler, A.; Grimm, F.; Arnold, F.,
Laboratory investigations of negative ion molecule reactions of propionic, butyric, glyoxylic, pyruvic, and pinonic acids,
Int. J. Mass Spectrom., 2000, 194, 1, 53-68, https://doi.org/10.1016/S1387-3806(99)00172-4
. [all data]